program: Gaussian 09
title: 000216154
version: EM64L-G09RevD.01
frameworkgroup: C1[X(C12H15NO2)]
method: RPBEPBE
basis: SDD
operation: Freq
keyword: #p
keyword: freq=noraman
keyword: PBEPBE/SDD
title: #p freq=noraman PBEPBE/SDD
converged: YES YES NO NO
title: Mulliken charges:
elementType: O O N C C C C C C C C C C C C H H H H H H H H H H H H H H H
charge: -0.433705 -0.279527 -0.368535 -0.548286 -0.378945 0.482047 -0.397339 -0.377328 -0.349189 -0.382174 0.277796 0.156541 0.341868 -0.783337 -0.679046 0.213812 0.230086 0.261184 0.220869 0.321454 0.245857 0.233906 0.253766 0.219275 0.231560 0.215886 0.263956 0.229245 0.224635 0.353667
chargesum: 0.00000
title: Mulliken charges with hydrogens summed into heavy atoms:
elementType: O O N C C C C C C C C C C C C
charge: -0.080038 -0.279527 -0.047081 -0.104388 0.103108 0.482047 -0.151482 -0.143422 -0.095423 -0.162899 0.277796 0.156541 0.341868 -0.071935 -0.225165
polarizability: 1.80201461e+02 -1.71306328e+01 1.50436915e+02 2.01762215e+01 9.84823096e+00 9.30977622e+01
1716.lowfreq: -13.2771 -7.9961 -0.0007 -0.0006 -0.0004 4.6500 13.5736 26.8962 44.0592
frequency: 10.7614 26.8166 43.9355 67.2385 81.6376 87.5130 151.7182 162.5122 228.1707 274.6249 312.4721 315.3380 351.8002 359.6626 379.3850 405.4970 413.1895 436.7045 479.0245 513.9310 554.5075 572.0536 585.1121 635.8716 646.5942 703.1878 724.1909 775.1557 795.5926 808.5711 820.5331 837.9085 869.0728 931.7008 942.0250 956.3712 962.6132 971.0254 999.5517 1004.0110 1025.5880 1053.8633 1076.1614 1104.5101 1143.5779 1175.7727 1178.9348 1194.0758 1212.0726 1244.9488 1247.7879 1304.0781 1311.9600 1322.8727 1359.2093 1389.5036 1392.7770 1424.1980 1429.5013 1449.0493 1452.8159 1467.2006 1476.0190 1487.8220 1504.1246 1583.8142 1595.4166 1625.5972 1653.0449 2983.8307 2991.8171 2994.9876 3057.0467 3066.6604 3076.5740 3090.1028 3102.9519 3107.6790 3125.2599 3132.9663 3168.3066 3190.2000 3555.6937 3583.6170
redmass: 4.1451 4.8375 3.9779 4.1530 3.9372 4.8247 1.0512 5.1475 3.0522 3.8680 3.6622 3.1799 1.1141 2.6860 3.8342 3.0453 2.9529 4.0875 3.2057 2.9757 2.2398 3.0809 1.2610 6.6459 1.5116 3.9454 3.0219 2.5073 2.3738 1.8486 2.7514 1.8008 2.4252 1.3678 1.9182 1.3375 1.5112 2.1563 1.4757 2.6090 1.7607 1.5146 3.4746 1.4528 1.3678 1.4026 1.1145 1.6592 2.2643 1.7478 1.9668 2.6128 1.3561 1.2461 1.3467 5.8440 1.2389 2.7694 1.2198 1.0495 1.1236 1.1168 1.0653 1.9123 2.6949 6.5322 6.4210 6.4006 4.8538 1.0372 1.0613 1.0637 1.0999 1.0951 1.1010 1.0629 1.1010 1.0873 1.0901 1.0962 1.0952 1.1135 1.0773 1.0661
irintensity: 2.9178 0.5032 2.7688 5.8457 0.3194 3.3384 0.7437 1.5165 3.2055 5.8946 7.4175 10.1923 142.5559 5.7853 7.7619 7.0934 1.6372 2.1291 18.6321 4.2515 14.5549 12.0413 123.2778 0.5981 4.6934 10.3113 4.1002 2.8845 20.3357 21.3595 8.2829 29.4362 12.4283 0.1220 5.2233 50.8265 0.7761 10.6478 11.3908 1.6892 20.8162 6.8678 9.9495 33.2970 220.0526 44.1027 6.7826 20.9535 1.1462 57.9656 26.4165 14.9700 10.2493 19.2537 11.4893 14.1319 35.2860 11.8961 7.8331 19.2584 33.8625 12.5814 26.8244 222.4113 79.5701 195.3406 9.1286 34.4080 4.3609 19.8635 29.2997 38.5880 22.7225 14.7165 7.6200 4.9987 16.6395 17.1800 22.6295 12.6948 4.7418 23.1796 14.3601 39.6755
temp: 298.150 k
press: 1.00000 atm
elementType: 8 8 7 6 6 6 6 6 6 6 6 6 6 6 6 1 1 1 1 1 1 1 1 1 1 1 1 1 1 1
symmnumber: 1
zpe: 641865.7 jmol-1
zpe.correction: 0.244474 hartree
zpe.thermalcorrener: 0.259805 hartree
zpe.thermalcorrenthalpy: 0.260749 hartree
zpe.thermalcorrgfe: 0.199125 hartree
zpe.sumelectzpe: -670.354921 hartree
zpe.sumelectthermal: -670.339590 hartree
zpe.sumelectthermalent: -670.338645 hartree
zpe.sumelectthermalfe: -670.400270 hartree
dipole: -3.3433 0.5252 -2.3753
dipole: 4.1347
quadrupole: -90.1005 -87.8620 -88.6268
quadrupole: 13.3990 5.0938 2.6515
quadrupole: -1.2374 1.0011 0.2363 13.3990 5.0938 2.6515
hfenergy: -670.5993948 hartree
pointgroup: C01 [X(C12H15N1O2)]
dipole: -1.4742404 -0.3903536 0.5660708 debye
polarizability: 184.0915741|15.2095444|140.4755219|2.6030542|26.7608533|99.1690427 unknown
InChI: InChI=1S/C12H15NO2/c1-9(2)12(15)13-8-7-10-3-5-11(14)6-4-10/h3-6,13-14H,1,7-8H2,2H3
charge 0 multiplicity 1
30 atoms
O  -4.490475 -1.632911 -1.01809
O  3.482445 1.131621 0.705941
N  1.308084 0.34001 0.991882
C  -0.146057 2.068579 -0.131723
C  0.701617 1.671357 1.113757
C  -1.313762 1.125321 -0.379347
C  -1.203847 0.043716 -1.294666
C  -2.532979 1.270844 0.330798
C  -2.264436 -0.864069 -1.495898
C  -3.606479 0.372708 0.142949
C  -3.467594 -0.698481 -0.772766
C  2.661465 0.158994 0.748604
C  3.121123 -1.272362 0.555086
C  4.53988 -1.54434 1.005764
C  2.332917 -2.204062 -0.049732
H  -0.512249 3.10083 0.031434
H  0.524977 2.094731 -1.00968
H  1.532958 2.385996 1.242609
H  0.067706 1.700961 2.020662
H  0.70349 -0.480014 1.060432
H  -0.278378 -0.079144 -1.87053
H  -2.651554 2.103467 1.035322
H  -2.183898 -1.691583 -2.207097
H  -4.543342 0.510145 0.699119
H  4.632888 -1.4334 2.102892
H  4.868819 -2.558246 0.723147
H  5.220263 -0.79744 0.559745
H  2.690964 -3.226778 -0.213444
H  1.329531 -1.976285 -0.430338
H  -5.292977 -1.427664 -0.477231
