program: Gaussian 09
title: 000210778
version: EM64L-G09RevD.01
frameworkgroup: C1[X(C15H24NOS)]
method: RPBEPBE
basis: SDD
operation: Freq
keyword: #p
keyword: freq=noraman
keyword: PBEPBE/SDD
title: #p freq=noraman PBEPBE/SDD
converged: NO YES NO NO
title: Mulliken charges:
elementType: S O N C C C C C C C C C C C C C C C H H H H H H H H H H H H H H H H H H H H H H H H
charge: 0.283202 -0.197825 -0.150327 0.502492 -0.528132 -0.550669 -0.340789 -0.341967 -0.401643 -0.395526 -0.229792 -0.606104 -0.397980 -0.356856 -0.361172 -0.284295 -0.144799 -0.472889 0.218910 0.218636 0.224506 0.232385 0.268205 0.259390 0.280556 0.279432 0.229274 0.235607 0.236956 0.229596 0.265398 0.257810 0.289644 0.241156 0.202507 0.213333 0.269882 0.269250 0.221434 0.269041 0.271016 0.291147
chargesum: 1.00000
title: Mulliken charges with hydrogens summed into heavy atoms:
elementType: S O N C C C C C C C C C C C C C C C
charge: 0.283202 -0.197825 -0.150327 0.502492 -0.090586 -0.093778 0.186806 0.218021 0.063238 0.071026 -0.229792 0.206749 0.045683 0.126359 0.129512 -0.015254 0.126217 -0.181742
polarizability: 1.97789238e+02 1.80801502e+01 1.76528049e+02 -5.11241363e-01 -7.17161959e+00 1.60941790e+02
1716.lowfreq: -13.2115 0.0011 0.0013 0.0013 3.5461 9.0115 32.9190 66.5470 79.2627
frequency: 31.4112 66.5467 79.2610 95.0628 129.6234 153.0937 161.0209 181.3567 204.7059 228.8991 249.4713 265.0388 274.9775 287.8697 309.2575 358.4811 368.3366 389.5727 411.2793 421.0675 446.8963 459.6333 488.4362 496.5089 503.3022 532.0662 570.2958 627.6857 645.4013 660.5909 688.8473 726.6983 729.2674 791.0858 801.6280 811.6609 814.9777 825.4128 854.1011 863.6693 880.3540 893.4306 916.0264 929.1609 933.9719 946.1836 992.1890 999.1059 1006.9662 1022.8685 1031.5997 1039.5717 1050.5998 1075.5228 1079.3920 1084.8364 1106.4399 1109.0275 1123.2321 1132.8958 1153.7251 1158.6621 1184.7707 1204.0741 1213.6618 1238.4683 1251.9230 1262.8408 1271.0175 1285.7093 1292.7046 1299.7056 1310.0667 1324.5512 1336.6986 1342.2522 1343.0273 1346.1016 1355.1298 1365.0447 1369.5465 1379.3394 1423.4380 1443.6737 1450.4709 1458.7624 1460.0371 1463.9843 1467.9745 1468.8976 1469.5565 1477.4474 1483.8468 1486.2710 1490.8597 1530.6089 2975.8050 2980.4521 2983.3156 2996.9151 3000.7632 3001.8923 3007.1147 3039.9592 3045.9090 3048.4946 3056.0889 3058.0284 3063.3844 3070.0792 3076.2894 3093.1067 3097.0485 3127.0276 3130.3662 3145.1076 3157.9730 3168.8277 3195.4147 3240.1398
redmass: 2.8773 5.4163 4.6092 3.6476 3.4833 1.7773 2.1226 3.3352 4.1884 3.8531 2.4476 2.7171 2.3362 2.3264 2.5892 3.0544 1.9488 2.3222 2.3126 2.4051 3.9872 3.6445 2.9337 2.7087 2.4149 3.5984 3.1461 6.7075 2.1735 3.2333 6.5807 3.5433 1.1684 1.4623 3.0400 3.8509 2.1499 2.7443 1.5975 1.5528 2.1734 2.6843 2.3001 1.4092 1.6564 2.2687 2.4921 2.4745 2.3387 2.0137 2.0805 1.7881 2.2225 1.8665 1.6142 3.6444 1.8922 1.2957 1.6230 1.4184 1.7970 1.5628 1.9510 1.1891 1.6865 1.5155 1.2945 1.2894 1.1861 1.3052 1.4472 1.6392 1.2678 1.2814 1.4634 1.2919 1.4924 1.3975 1.4713 1.4162 1.2840 1.2332 1.1459 1.0839 1.1060 1.6331 1.9903 1.0895 1.0829 1.0897 1.0861 1.0849 1.0914 1.0692 1.0671 5.0091 1.0680 1.0683 1.0661 1.0588 1.0605 1.0623 1.0618 1.0344 1.0597 1.0614 1.0959 1.0985 1.1008 1.1020 1.1025 1.0954 1.0968 1.1059 1.1057 1.1025 1.1040 1.0921 1.0955 1.1011
irintensity: 0.7945 0.6259 0.3377 0.9726 5.1809 1.1491 1.0830 1.8939 4.8594 3.3745 0.1104 0.6247 1.3156 0.3889 2.0740 9.0248 0.4774 2.6501 0.9159 0.8311 3.4917 0.9135 0.6175 11.2270 2.9390 3.7278 8.5967 1.5591 102.0975 57.1718 2.2957 8.3660 96.9362 1.0523 8.6013 22.1916 1.9242 2.9136 2.0573 10.0798 2.4468 6.1463 4.3743 0.2394 13.1291 12.3823 6.1012 20.2317 7.4984 3.6056 6.9620 24.3836 12.7000 7.0077 3.9681 21.2817 0.8012 4.3870 1.5238 0.3081 4.3234 0.5800 2.6400 15.9394 14.3051 21.0774 15.2857 8.0898 1.1046 3.0778 8.5960 23.9590 13.5620 20.6852 7.4512 8.4646 8.1560 3.1624 2.3975 3.4264 0.9168 14.8148 22.7270 5.1327 2.1906 29.3640 29.6403 3.9352 7.3091 15.9154 11.5191 17.9315 13.9381 18.1062 41.4201 8.7513 28.2166 47.7704 24.3171 10.3077 33.6330 12.7702 13.0633 8.3660 3.6450 1.7320 21.5529 25.3133 9.7654 2.1717 75.7383 7.6069 3.9568 0.8277 7.5579 5.2959 2.3202 2.8943 0.4080 4.5955
temp: 298.150 k
press: 1.00000 atm
elementType: 16 8 7 6 6 6 6 6 6 6 6 6 6 6 6 6 6 6 1 1 1 1 1 1 1 1 1 1 1 1 1 1 1 1 1 1 1 1 1 1 1 1
symmnumber: 1
zpe: 962887.5 jmol-1
zpe.correction: 0.366744 hartree
zpe.thermalcorrener: 0.384112 hartree
zpe.thermalcorrenthalpy: 0.385057 hartree
zpe.thermalcorrgfe: 0.322660 hartree
zpe.sumelectzpe: -1112.345832 hartree
zpe.sumelectthermal: -1112.328464 hartree
zpe.sumelectthermalent: -1112.327520 hartree
zpe.sumelectthermalfe: -1112.389917 hartree
dipole: 1.4096 -0.7926 -0.7810
dipole: 1.7959
quadrupole: -97.3246 -93.6638 -101.6237
quadrupole: 3.4946 -7.7088 -3.1766
quadrupole: 0.2128 3.8735 -4.0863 3.4946 -7.7088 -3.1766
hfenergy: -1112.7125766 hartree
pointgroup: C01 [X(C15H24N1O1S1)]
dipole: -0.5423864 -0.318014 0.322333 debye
polarizability: 200.1529389|-16.5965112|175.3563864|2.0058062|5.108128|159.7497522 unknown
InChI: InChI=1S/C15H24NOS/c1-16(9-11-17-12-10-16)15(7-3-2-4-8-15)14-6-5-13-18-14/h5-6,13H,2-4,7-12H2,1H3
charge 1 multiplicity 1
42 atoms
S  2.312432 -0.965818 1.484425
O  -4.043682 -0.629721 -0.525203
N  -1.245468 -0.22507 0.39842
C  0.285804 0.556002 0.05183
C  0.154107 1.277462 -1.318098
C  0.513234 1.603964 1.17179
C  -2.366038 0.80594 0.626271
C  -1.643295 -1.107548 -0.795711
C  1.392469 2.17595 -1.604819
C  1.756672 2.49449 0.881842
C  1.32305 -0.530969 0.013231
C  -1.087255 -1.085425 1.641427
C  1.62582 3.20465 -0.480375
C  -3.770278 0.162802 0.673858
C  -3.052922 -1.704094 -0.644942
C  1.734305 -1.307922 -1.071484
C  2.786738 -2.241491 -0.776571
C  3.208382 -2.190778 0.5427
H  -0.739696 1.929321 -1.316336
H  0.042467 0.563757 -2.151242
H  0.637258 1.125165 2.160627
H  -0.358456 2.280216 1.228333
H  -2.324231 1.522835 -0.207411
H  -2.16671 1.330839 1.573772
H  -0.876234 -1.891267 -0.903905
H  -1.643239 -0.463186 -1.686928
H  1.227554 2.685774 -2.571567
H  2.290043 1.540378 -1.723432
H  2.676151 1.881014 0.900771
H  1.847029 3.232361 1.699737
H  -0.690262 -0.475211 2.46462
H  -2.062816 -1.493783 1.94029
H  -0.394623 -1.910766 1.429395
H  2.538991 3.790082 -0.689986
H  0.78511 3.927126 -0.450278
H  -3.91277 -0.452644 1.586586
H  -4.522194 0.968151 0.683729
H  -3.309266 -2.249219 -1.5672
H  -3.132266 -2.408908 0.208004
H  1.317526 -1.20257 -2.076719
H  3.222438 -2.917297 -1.515022
H  3.988421 -2.76729 1.037681
