program: Gaussian 09
title: 000210776
version: EM64L-G09RevD.01
frameworkgroup: C1[X(C13H23NS)]
method: RPBEPBE
basis: SDD
operation: Freq
keyword: #p
keyword: freq=noraman
keyword: PBEPBE/SDD
title: #p freq=noraman PBEPBE/SDD
converged: NO YES NO NO
title: Mulliken charges:
elementType: S N C C C C C C C C C C C C C H H H H H H H H H H H H H H H H H H H H H H H
charge: 0.169770 -0.159507 0.503786 -0.481603 -0.463232 -0.383033 -0.380242 -0.546150 -0.400591 -0.400603 -0.401211 -0.716363 -0.711955 -0.030046 -0.610634 0.243631 0.207550 0.204252 0.251763 0.177855 0.217025 0.215821 0.178277 0.214475 0.213579 0.191347 0.203143 0.203170 0.191112 0.215024 0.189143 0.277878 0.243519 0.244503 0.276259 0.223221 0.214555 0.214512
chargesum: 0.00000
title: Mulliken charges with hydrogens summed into heavy atoms:
elementType: S N C C C C C C C C C C C C C
charge: 0.169770 -0.159507 0.503786 -0.030421 -0.007217 0.011847 0.013856 -0.118097 -0.006100 -0.006321 0.002956 -0.194966 -0.191194 0.193175 -0.181567
polarizability: 1.75062951e+02 8.05975012e+00 1.54748504e+02 -5.24768998e+00 -8.37270224e+00 1.47833003e+02
1716.lowfreq: -9.8615 -4.3318 0.0011 0.0012 0.0024 12.8538 42.1729 55.1426 62.1295
frequency: 42.0293 54.9035 62.1095 75.7216 114.3592 151.7674 176.1975 212.4431 221.5453 244.0351 266.3400 302.5594 311.4735 329.2461 377.8400 391.5368 409.7324 446.6505 451.0437 472.4220 478.9565 534.8584 549.6397 606.3375 636.4883 651.3094 701.3125 779.8470 790.6877 806.7118 846.5728 857.3423 870.9495 907.5193 915.8041 935.4720 937.4659 942.4909 951.6103 955.8189 995.6039 1006.6563 1016.1986 1033.7895 1058.4960 1067.1652 1071.7884 1079.9370 1090.2266 1120.4258 1136.0234 1146.0358 1146.7988 1148.8685 1198.5828 1208.7771 1224.0012 1236.4464 1261.2100 1267.4023 1277.2237 1289.4132 1291.1480 1294.6509 1305.6885 1327.2037 1328.6561 1333.6970 1343.4034 1348.1368 1352.0426 1352.9698 1370.8089 1422.3278 1423.9847 1431.6366 1451.3696 1457.1783 1459.7485 1461.0022 1466.6279 1470.2598 1478.0445 1483.3465 1650.7875 2835.5243 2846.4852 2955.9666 2965.9681 2979.0683 2981.8225 2982.2984 2983.3447 3024.2858 3026.1385 3027.0735 3032.3492 3040.9898 3043.1378 3048.6344 3050.6714 3066.0952 3070.1024 3079.7214 3092.8425 3098.3866 3100.1790 3191.9219
redmass: 2.5751 3.0490 4.5247 3.4318 3.1990 2.7176 2.7924 2.2402 2.3490 2.6420 2.9913 2.4539 2.5655 2.5512 2.3272 2.1841 2.1938 2.8129 2.3807 1.9756 2.8849 1.8385 2.0661 4.5005 4.5049 2.3394 2.2577 1.6388 2.6868 1.4773 1.9571 1.8043 1.6140 2.1293 2.0940 1.4817 1.5938 1.8604 2.4144 1.3249 1.4132 1.5396 2.8656 2.5455 2.0826 2.2848 1.8363 1.9984 1.5379 2.7325 1.2910 1.5497 1.5670 1.4391 1.5055 1.3251 1.7231 1.3758 1.2592 1.1922 1.2159 1.3304 1.3070 1.4069 1.3015 1.4183 1.2918 1.3438 1.4575 1.4786 1.4898 1.4281 1.3471 1.0937 1.1652 1.0912 1.0913 1.1115 1.0884 1.0799 1.0933 1.0788 1.0874 1.0903 4.5490 1.0720 1.0705 1.0609 1.0628 1.0634 1.0633 1.0602 1.0637 1.0962 1.0591 1.0606 1.0961 1.1025 1.0943 1.0938 1.1028 1.0855 1.0871 1.0654 1.0874 1.1069 1.1068 1.1143
irintensity: 0.0433 0.1805 0.3827 0.1741 0.5541 0.6007 0.0409 0.0898 2.8061 0.0135 0.4779 1.5554 1.7954 1.6372 1.7423 0.7665 0.2232 0.9702 12.7541 4.0277 0.4817 8.3430 0.9286 4.0985 0.8950 1.5482 10.6989 0.0621 3.2030 0.0020 3.3873 5.5453 5.4617 6.2584 38.3858 30.8926 16.5671 43.4695 29.7211 1.3509 7.6406 11.0064 4.8887 12.3041 9.3364 22.1297 11.5473 28.9895 8.9455 3.9350 0.9538 5.3135 6.6069 5.1637 2.1933 18.7901 12.8914 5.9976 1.3296 1.3981 24.0559 18.0600 2.4510 1.9271 0.6569 10.1758 8.9412 1.9847 0.0050 0.6466 8.5491 0.8061 0.3448 3.0620 5.8061 13.7848 7.4206 9.0707 18.3169 4.8427 9.9359 5.5581 9.4431 17.2826 31.1134 41.5494 128.9951 23.3720 38.9219 45.5070 13.6452 32.9974 46.7713 20.7594 16.9993 21.8970 76.0119 28.0134 23.2013 25.3348 81.5568 53.1056 21.8083 22.1517 7.7910 27.9378 12.5553 28.8112
temp: 298.150 k
press: 1.00000 atm
elementType: 16 7 6 6 6 6 6 6 6 6 6 6 6 6 6 1 1 1 1 1 1 1 1 1 1 1 1 1 1 1 1 1 1 1 1 1 1 1
symmnumber: 1
zpe: 883322.2 jmol-1
zpe.correction: 0.336440 hartree
zpe.thermalcorrener: 0.352058 hartree
zpe.thermalcorrenthalpy: 0.353002 hartree
zpe.thermalcorrgfe: 0.293684 hartree
zpe.sumelectzpe: -960.750590 hartree
zpe.sumelectthermal: -960.734971 hartree
zpe.sumelectthermalent: -960.734027 hartree
zpe.sumelectthermalfe: -960.793345 hartree
dipole: 1.5444 -2.2887 -0.3292
dipole: 2.7806
quadrupole: -101.5787 -111.9933 -94.9847
quadrupole: 3.0262 0.6292 -2.3890
quadrupole: 1.2735 -9.1411 7.8676 3.0262 0.6292 -2.3890
hfenergy: -961.0870293 hartree
pointgroup: C01 [X(C13H23N1S1)]
dipole: -0.6628776 -0.8550556 0.1620292 debye
polarizability: 173.9205817|-9.4027965|156.4423413|-4.4979495|8.4326537|147.281535 unknown
InChI: InChI=1S/C13H23NS/c1-2-6-13(7-11-15-12-8-13)14-9-4-3-5-10-14/h2H,1,3-12H2
charge 0 multiplicity 1
38 atoms
S  1.847251 2.83691 -0.295724
N  -0.827912 0.032823 0.020597
C  0.648339 -0.263236 0.136383
C  1.26099 0.564377 1.312687
C  1.380567 0.16363 -1.174652
C  -1.526433 -0.54664 -1.157317
C  -1.639679 -0.179115 1.248032
C  0.8940 -1.80599 0.391848
C  -2.902679 0.122201 -1.368109
C  -3.020465 0.502832 1.123582
C  -3.785031 -0.022987 -0.110068
C  0.997626 2.075826 1.216459
C  1.144023 1.628666 -1.574797
C  2.336556 -2.232209 0.550983
C  3.000647 -3.068288 -0.288068
H  2.353887 0.398674 1.310893
H  0.89025 0.185092 2.286233
H  1.08518 -0.497911 -2.013522
H  2.462438 -0.006795 -1.025542
H  -1.683791 -1.650716 -1.043307
H  -0.913541 -0.397527 -2.060789
H  -1.109644 0.240309 2.118511
H  -1.802262 -1.269212 1.453394
H  0.440139 -2.3736 -0.443844
H  0.337075 -2.079326 1.312926
H  -3.397407 -0.332775 -2.24838
H  -2.745557 1.19609 -1.588769
H  -2.87001 1.595984 1.02824
H  -3.600015 0.322802 2.050017
H  -4.741306 0.518603 -0.238111
H  -4.03723 -1.093372 0.041525
H  -0.080256 2.292481 1.143492
H  1.424384 2.613748 2.08013
H  1.66932 1.876984 -2.512865
H  0.069485 1.846639 -1.687197
H  2.869659 -1.840239 1.430651
H  4.045847 -3.349029 -0.11478
H  2.515551 -3.497509 -1.174142
