program: Gaussian 09
title: 000216186
version: EM64L-G09RevD.01
frameworkgroup: C1[X(C14H18N2O5)]
method: RPBEPBE
basis: SDD
operation: Freq
keyword: #p
keyword: freq=noraman
keyword: PBEPBE/SDD
title: #p freq=noraman PBEPBE/SDD
converged: YES YES NO NO
title: Mulliken charges:
elementType: O O O O O N N C C C C C C C C C C C C C C H H H H H H H H H H H H H H H H H H
charge: -0.251317 -0.437794 -0.210371 -0.444442 -0.404095 -0.452061 -0.382658 -0.220555 -0.464385 -0.416634 -0.424614 0.234468 -0.159598 -0.627365 0.597058 0.164176 -0.503864 -0.462007 0.150400 -0.350437 0.129431 0.239946 0.224821 0.258137 0.233637 0.223943 0.250422 0.232109 0.331635 0.317073 0.320860 0.221899 0.244192 0.230312 0.230958 0.210096 0.389406 0.430199 0.347021
chargesum: 0.00000
title: Mulliken charges with hydrogens summed into heavy atoms:
elementType: O O O O O N N C C C C C C C C C C C C C C
charge: -0.251317 -0.048388 -0.210371 -0.014243 -0.057074 -0.120427 -0.061798 0.019391 0.018573 0.040946 0.057917 0.234468 0.157474 -0.161274 0.597058 0.164176 -0.273552 -0.231049 0.150400 -0.140340 0.129431
polarizability: 2.26362015e+02 6.04218861e-01 1.99565135e+02 2.82774081e+00 2.28226428e+01 1.27376376e+02
1716.lowfreq: -47.1892 -12.1363 -7.2405 -3.9161 -0.0003 0.0004 0.0007 34.5781 38.1215
frequency: -47.0589 34.5660 37.9054 51.9363 62.9229 69.3826 97.8033 101.8693 133.6612 140.4375 171.8249 190.1851 216.8147 255.3750 262.7070 291.2194 300.4058 308.3106 345.5592 346.3274 369.7639 409.6766 456.1687 469.5875 504.6221 511.2566 557.5454 567.6680 593.4439 601.7267 613.2447 635.6133 653.9089 684.0454 685.8235 724.9180 730.9431 743.9456 767.8272 786.7810 794.5578 834.8089 857.4293 861.4263 871.0546 884.3208 900.6302 902.1198 936.7691 949.7206 967.8464 993.0782 1006.4317 1026.8418 1063.1173 1069.9112 1079.3768 1085.4831 1096.6213 1153.6365 1157.7067 1171.7114 1180.5784 1188.3078 1207.0796 1230.1614 1237.8496 1243.5292 1253.6039 1256.1477 1265.4046 1286.3785 1288.2966 1292.3113 1301.1305 1306.4396 1318.4771 1329.4917 1342.0338 1390.6845 1415.3446 1420.3163 1460.4237 1466.0704 1477.5285 1481.1687 1487.5390 1493.7898 1538.7771 1600.3603 1620.3001 1624.7721 1674.0436 2396.5133 2982.8890 2994.9668 3011.7012 3016.6680 3027.4617 3054.1155 3066.9994 3077.0819 3087.0291 3100.0998 3103.9732 3137.3651 3143.2208 3340.9564 3522.9018 3543.7176 3568.2149
redmass: 1.8025 10.1067 4.6382 6.5185 3.3621 5.6051 6.5209 4.7187 5.9490 5.3777 4.2281 4.5012 5.0352 4.5500 5.6268 6.0332 5.2153 4.0155 3.6998 1.2403 3.8482 3.5909 4.7310 3.4080 4.3924 4.1930 2.5552 4.3553 1.7628 1.6501 2.2010 3.3305 2.5812 4.9322 4.4485 4.7179 4.9974 5.3473 5.2130 1.4848 1.3342 3.7016 2.1885 1.8532 1.7534 2.0554 1.3626 3.0907 2.9697 3.4700 3.2903 2.1427 1.8574 2.3804 3.3530 2.9040 2.4230 2.2055 2.1150 1.1654 1.4698 1.3603 1.3238 1.2497 1.5281 1.2877 1.8912 1.4867 1.3696 1.2908 2.3422 1.3030 1.5052 1.4836 1.3511 1.4762 1.5298 1.3254 1.6173 4.9521 2.7621 1.3499 1.1392 1.0860 1.1138 1.7802 1.1002 1.8032 2.0361 6.2386 5.7534 3.7725 9.1126 1.0804 1.0620 1.0858 1.0586 1.0625 1.0643 1.0985 1.1038 1.0871 1.1040 1.1056 1.0879 1.0929 1.0926 1.0734 1.0643 1.0773 1.0658
irintensity: 0.0681 3.0423 2.2864 1.3908 2.0816 1.4809 0.7751 1.1211 1.2634 2.2209 16.4818 5.5485 3.8827 4.3421 4.9521 1.4339 17.0541 3.5141 34.8017 94.1812 17.5330 5.6173 6.4336 2.0952 24.8773 11.9384 16.1017 5.9042 55.9447 155.5599 52.4136 65.0581 3.5852 10.1672 30.1573 3.6170 5.8633 5.3612 3.5971 47.9714 7.9287 72.1242 23.7495 23.0116 103.3112 58.2265 2.0949 11.7137 76.0328 7.1210 4.4595 24.2098 22.6779 0.7198 77.0561 9.1981 168.4136 16.2815 163.6077 65.6243 21.2573 22.2024 42.4416 2.9054 18.8604 23.2406 55.8062 9.0791 10.8901 1.2102 194.4893 24.1398 22.2173 6.7219 5.4416 12.1727 5.5723 5.5720 43.6974 4.0510 33.7585 46.6159 42.1969 4.8123 11.4699 114.0823 17.9248 156.8552 12.6402 87.4893 84.3213 73.5382 276.2651 2272.6999 30.5498 26.1595 10.7691 46.2335 43.1728 9.0452 4.6140 5.3629 5.9954 48.9930 22.9113 32.5755 3.0021 14.9569 34.4351 33.9609 33.3905
temp: 298.150 k
press: 1.00000 atm
elementType: 8 8 8 8 8 7 7 6 6 6 6 6 6 6 6 6 6 6 6 6 6 1 1 1 1 1 1 1 1 1 1 1 1 1 1 1 1 1 1
symmnumber: 1
zpe: 813499.8 jmol-1
zpe.correction: 0.309846 hartree
zpe.thermalcorrener: 0.328930 hartree
zpe.thermalcorrenthalpy: 0.329874 hartree
zpe.thermalcorrgfe: 0.261621 hartree
zpe.sumelectzpe: -1028.341748 hartree
zpe.sumelectthermal: -1028.322664 hartree
zpe.sumelectthermalent: -1028.321719 hartree
zpe.sumelectthermalfe: -1028.389973 hartree
dipole: -1.6388 -4.2514 -1.6266
dipole: 4.8380
quadrupole: -128.4754 -100.8212 -127.5501
quadrupole: -4.1715 17.4551 12.6990
quadrupole: -9.5265 18.1277 -8.6011 -4.1715 17.4551 12.6990
hfenergy: -1028.6515937 hartree
pointgroup: C01 [X(C14H18N2O5)]
dipole: 1.6137101 -0.5851246 0.8225121 debye
polarizability: 208.0808996|16.0395939|212.121485|25.128161|-16.7739288|133.1011406 unknown
InChI: InChI=1S/C14H18N2O5/c17-11-4-3-8(7-12(11)18)6-10(14(20)21)16-13(19)9-2-1-5-15-9/h3-4,7,9-10,15-18,20H,1-2,5-6H2
charge 0 multiplicity 1
39 atoms
O  0.924316 -0.674209 -1.660664
O  3.574887 2.142208 1.107325
O  3.266944 3.536454 -0.730484
O  -2.535638 -1.417994 0.779164
O  -4.486404 -0.226086 -0.829006
N  -0.263127 -2.574515 0.071343
N  1.724207 0.395313 0.258537
C  1.092001 -1.997908 0.379798
C  2.112875 -3.11398 -0.016323
C  1.317687 -4.45521 0.108813
C  -0.154826 -4.030107 0.415763
C  1.248735 -0.699948 -0.433882
C  1.610696 1.763859 -0.256151
C  0.414893 2.549701 0.432682
C  -0.92938 1.899556 0.158173
C  2.887541 2.566351 -0.045873
C  -1.241348 0.643448 0.73566
C  -1.868439 2.477614 -0.727234
C  -2.379585 -0.106686 0.358971
C  -3.075159 1.799934 -1.024051
C  -3.334389 0.51027 -0.505412
H  1.140942 -1.796735 1.467585
H  3.008792 -3.092013 0.627592
H  2.437689 -2.950137 -1.058646
H  1.3768 -5.027142 -0.83308
H  1.717663 -5.097962 0.912027
H  -0.90766 -4.602404 -0.15044
H  -0.380281 -4.146185 1.490898
H  -0.414324 -2.440948 -0.947808
H  1.412334 1.695132 -1.338801
H  2.015953 0.289526 1.232599
H  0.63048 2.593409 1.518855
H  0.434286 3.585487 0.047041
H  -0.578036 0.198305 1.485033
H  -1.663894 3.449619 -1.190338
H  -3.806483 2.264902 -1.699538
H  4.372563 2.719567 1.249987
H  -1.601118 -1.905418 0.665664
H  -5.065495 0.303328 -1.433078
