program: Gaussian 09
title: 000216181
version: EM64L-G09RevD.01
frameworkgroup: C1[X(C11H16BrClN2O)]
method: RPBEPBE
basis: SDD
operation: Freq
keyword: #p
keyword: freq=noraman
keyword: PBEPBE/SDD
title: #p freq=noraman PBEPBE/SDD
converged: YES YES NO NO
title: Mulliken charges:
elementType: Br Cl O N N C C C C C C C C C C C H H H H H H H H H H H H H H H H
charge: -0.016727 -0.086209 -0.475566 -0.106235 -0.676044 -0.392961 -0.182827 0.426712 -0.301242 -0.638563 -0.403127 -0.400250 -0.701066 -0.383085 -0.281563 0.694940 0.180514 0.237419 0.206402 0.221770 0.181559 0.221876 0.193318 0.241599 0.303735 0.288783 0.214749 0.232717 0.216130 0.343545 0.317948 0.321746
chargesum: 0.00000
title: Mulliken charges with hydrogens summed into heavy atoms:
elementType: Br Cl O N N C C C C C C C C C C C
charge: -0.016727 -0.086209 -0.132021 -0.106235 -0.036350 0.024972 0.023575 0.426712 0.102087 0.018230 -0.099392 -0.111467 -0.037470 -0.383085 -0.281563 0.694940
polarizability: 2.19748066e+02 8.60459751e-01 1.86792025e+02 -1.53908789e+01 -1.26027320e-01 9.63023789e+01
1716.lowfreq: -7.3429 -5.2754 -1.0535 0.0005 0.0008 0.0009 10.8910 28.8014 48.7994
frequency: 9.6419 28.7933 48.7056 77.5537 89.6094 105.4902 123.5714 141.2007 166.9403 194.7562 200.8371 212.4204 256.9087 268.2627 279.0809 289.3630 295.4312 310.0913 346.4820 356.8275 397.8056 408.5446 435.3094 454.8490 456.8086 480.6382 507.9867 514.7345 580.1918 621.7842 714.0823 727.0856 755.4971 781.8635 802.8223 859.4809 880.9599 917.0133 949.8132 967.5531 995.3551 1037.3681 1044.0126 1046.4504 1049.0180 1076.3150 1096.7958 1121.6940 1143.3434 1162.9220 1208.8676 1221.0171 1232.4961 1283.6894 1285.7446 1297.1298 1315.1874 1332.6303 1364.6177 1371.9434 1384.6308 1392.2631 1403.8544 1433.0528 1452.8417 1466.2646 1469.1709 1476.2780 1486.7964 1490.9258 1505.3833 1542.2124 1599.5359 1636.8044 2827.7886 2849.2181 2864.9523 2942.2689 2987.2127 3026.2589 3032.7381 3052.8131 3081.4511 3087.4294 3090.7360 3165.8870 3191.2714 3544.3767 3569.9041 3689.9070
redmass: 5.8075 4.0472 2.6484 2.7688 7.6267 2.9460 8.4325 4.5951 8.5401 4.2081 1.1193 2.0622 1.2527 4.1830 1.6926 3.8580 4.9657 3.7023 3.7914 4.1913 2.3312 3.5532 1.2721 1.9604 1.3903 4.8335 3.7622 2.9347 4.7781 3.5770 9.0082 6.0203 4.1343 3.3503 1.1368 3.4880 1.6285 1.3454 2.2238 2.3673 5.5135 1.7829 2.3134 2.1739 2.2117 2.7715 1.4387 1.5527 1.4594 1.6876 1.3529 2.0108 1.3600 1.6774 1.1730 1.2793 2.6105 1.3803 3.6191 1.4232 1.4838 1.3719 5.4009 1.1675 1.0975 1.0501 1.0622 1.0633 1.0528 1.0609 4.1140 7.7445 1.6332 2.9112 1.0707 1.0703 1.0578 1.0829 1.0355 1.0873 1.0744 1.0888 1.0992 1.0997 1.1001 1.0924 1.0920 1.0446 1.0659 1.1045
irintensity: 0.2492 0.0298 1.1543 0.6455 0.5700 4.2634 1.0873 0.6783 0.5834 1.0807 0.3586 4.8787 99.4970 5.5546 25.7975 3.0705 10.3951 25.8618 25.9861 2.4619 1.1364 2.2439 213.2449 4.3685 69.0473 0.6512 4.5450 11.2625 15.0807 9.2197 80.4767 23.2219 31.1503 12.0656 7.0355 3.1645 25.4008 9.0990 7.0418 7.6207 40.7561 53.2739 1.8691 30.1695 83.4738 7.3793 3.4458 8.2788 107.4920 23.7058 2.3691 18.9113 7.3155 2.2715 5.0489 11.6781 6.2687 12.6117 76.9513 20.9399 29.9582 25.4588 4.6907 14.0041 3.0616 8.6370 3.5195 10.6273 21.6310 4.0721 154.5355 26.3247 78.5966 178.7030 84.2577 103.6591 241.7340 45.8307 24.6906 16.3719 30.6448 21.9975 47.7357 16.8380 57.9628 4.1197 2.7671 80.5387 4.9418 47.6328
temp: 298.150 k
press: 1.00000 atm
elementType: 35 17 8 7 7 6 6 6 6 6 6 6 6 6 6 6 1 1 1 1 1 1 1 1 1 1 1 1 1 1 1 1
symmnumber: 1
zpe: 666604.8 jmol-1
zpe.correction: 0.253896 hartree
zpe.thermalcorrener: 0.272223 hartree
zpe.thermalcorrenthalpy: 0.273167 hartree
zpe.thermalcorrgfe: 0.204937 hartree
zpe.sumelectzpe: -1085.765013 hartree
zpe.sumelectthermal: -1085.746687 hartree
zpe.sumelectthermalent: -1085.745743 hartree
zpe.sumelectthermalfe: -1085.813972 hartree
dipole: 3.3326 -0.3097 0.5761
dipole: 3.3961
quadrupole: -95.7286 -107.7353 -114.5771
quadrupole: -14.1575 -2.0865 2.3664
quadrupole: 10.2850 -1.7216 -8.5634 -14.1575 -2.0865 2.3664
hfenergy: -1086.0189098 hartree
pointgroup: C01 [X(C11H16Br1Cl1N2O1)]
dipole: -1.3059792 -0.262507 0.1038699 debye
polarizability: 204.7911978|27.901825|172.9721694|27.6048603|-34.2434217|125.079103 unknown
InChI: InChI=1S/C11H16BrClN2O/c1-3-15(2)6-10(16)7-4-8(12)11(14)9(13)5-7/h4-5,10,16H,3,6,14H2,1-2H3
charge 0 multiplicity 1
32 atoms
Br 3.803709 2.609587 0.032669
Cl 1.805905 -2.535246 1.522948
O  -0.956767 2.042156 -2.205357
N  -2.773105 -0.474037 -0.03997
N  3.807473 -0.247771 1.407906
C  -2.350108 0.854801 -0.532067
C  -1.115799 0.768396 -1.484575
C  0.187794 0.507378 -0.740955
C  -3.26159 -0.465918 1.364468
C  -3.679447 -1.159887 -0.9834
C  1.212892 1.482174 -0.701431
C  0.38327 -0.720634 -0.059917
C  -3.3673 -1.874689 1.977081
C  2.395813 1.225776 0.008535
C  1.574295 -0.938383 0.64047
C  2.639511 0.00839 0.712448
H  -3.180252 1.372081 -1.081864
H  -2.078922 1.499347 0.322675
H  -1.293801 -0.053777 -2.212582
H  -2.53619 0.122591 1.956223
H  -4.25213 0.051231 1.451307
H  -3.243593 -1.147678 -1.998196
H  -4.690884 -0.683112 -1.037992
H  -3.811035 -2.215975 -0.695206
H  1.068123 2.423428 -1.234809
H  -0.411303 -1.471657 -0.061996
H  -4.153621 -2.484507 1.497685
H  -2.404521 -2.407419 1.880949
H  -3.616919 -1.799448 3.051108
H  -1.811398 2.268245 -2.650949
H  3.923402 -1.13656 1.887847
H  4.5491 0.447218 1.43265
