program: Gaussian 09
title: 000216151
version: EM64L-G09RevD.01
frameworkgroup: C1[X(C13H17NO)]
method: RPBEPBE
basis: SDD
operation: Freq
keyword: #p
keyword: freq=noraman
keyword: PBEPBE/SDD
title: #p freq=noraman PBEPBE/SDD
converged: YES YES NO NO
title: Mulliken charges:
elementType: O N C C C C C C C C C C C C C H H H H H H H H H H H H H H H H H
charge: -0.292198 -0.379007 -0.050451 -0.542206 0.508009 -0.698811 -0.425427 -0.400113 0.182138 -0.230709 -0.255617 0.337865 -0.247423 -0.789160 -0.685964 0.251392 0.197988 0.227852 0.215372 0.197798 0.239792 0.299751 0.226827 0.265308 0.223662 0.229317 0.227227 0.234735 0.215958 0.263170 0.230464 0.222462
chargesum: 0.00000
title: Mulliken charges with hydrogens summed into heavy atoms:
elementType: O N C C C C C C C C C C C C C
charge: -0.292198 -0.079256 0.200941 -0.116367 0.508009 -0.045849 -0.198600 -0.134805 0.182138 -0.007046 -0.026301 0.337865 -0.020196 -0.075298 -0.233038
polarizability: 1.47349172e+02 -1.07983316e+01 1.54650254e+02 3.92245938e+00 1.47098810e+01 1.29720951e+02
1716.lowfreq: -9.9726 -4.1341 -0.0005 0.0006 0.0006 11.0073 23.3396 35.7285 44.6899
frequency: 23.1678 35.6242 44.3874 73.4116 89.3869 126.4271 139.7358 156.6326 202.7432 216.4301 244.3298 279.7304 306.7183 334.9380 363.5594 403.4645 430.4461 463.1302 479.5304 516.0948 575.5194 581.2867 600.0869 617.6807 655.9291 704.0309 735.7625 777.2118 795.1207 843.8869 855.4931 858.7310 898.4255 931.1822 939.0627 958.8609 961.0766 977.3266 990.0161 996.5085 1006.9061 1029.8364 1055.3648 1065.3307 1083.8970 1102.8266 1149.5801 1172.2848 1176.6997 1195.5951 1206.8208 1227.9558 1290.1755 1302.1592 1318.9743 1347.3338 1361.8128 1380.9114 1386.4978 1390.8711 1427.9468 1438.7626 1449.1603 1452.7456 1465.4256 1473.7273 1475.4375 1485.1062 1489.0198 1576.3787 1592.4068 1615.7320 1652.9472 2956.2567 2976.2093 2983.1969 3001.9505 3041.0165 3066.6860 3073.2690 3093.3008 3093.6200 3103.2810 3108.8427 3123.5768 3134.7422 3145.2801 3161.6078 3194.8801 3542.2980
redmass: 4.2228 3.8193 3.8435 4.3827 3.4252 3.3939 2.6948 1.1462 3.7380 1.0714 3.1977 3.1233 2.9233 3.8878 2.6857 2.8234 3.2543 2.9944 2.7608 2.9408 1.9338 2.2414 2.5779 6.3158 1.6600 2.1981 1.4496 2.2791 3.5966 4.4973 1.2622 2.1508 1.5147 1.6895 1.7173 1.3257 1.7096 1.4381 4.0388 1.4208 1.4266 2.1935 1.5093 1.7491 3.2624 1.6875 2.2315 1.0634 1.7330 1.1539 2.2260 1.6386 1.7293 1.8263 1.3668 1.4626 1.3813 3.5769 1.4156 1.2397 1.2153 1.8885 1.0498 1.2017 1.2260 1.0515 1.0691 1.6564 2.0907 6.5835 5.8843 5.9526 4.8807 1.0599 1.0370 1.0372 1.0984 1.0864 1.0952 1.0976 1.0997 1.0625 1.1009 1.0874 1.0859 1.0913 1.0958 1.1015 1.1138 1.0770
irintensity: 0.4718 4.1464 0.1548 8.4069 1.4654 0.6323 0.9551 1.4793 0.8759 0.1478 3.9353 9.5453 4.3532 5.6492 3.0115 0.2919 0.3204 8.6467 5.6762 4.7744 55.9834 27.0222 40.9299 0.6565 10.1566 36.0885 68.0848 8.2684 2.4757 0.3984 1.0646 6.1362 0.8730 6.1710 4.6908 65.7531 11.7750 0.2547 0.0564 0.5369 8.7621 6.5154 7.5404 10.1850 14.7157 5.9200 18.0496 1.4727 56.7263 2.2091 0.8790 54.8289 2.0717 1.4614 0.5875 12.1732 4.7931 1.8404 14.9317 32.9686 3.9272 3.7244 21.3364 27.3326 98.2710 15.3947 26.1556 77.2565 35.5145 153.8814 0.3007 8.7704 6.0877 28.1143 35.7928 14.9259 14.7185 4.8020 15.1312 43.9585 28.2175 6.1738 18.0993 10.6182 0.4171 17.3762 27.8009 25.5940 21.4477 11.4687
temp: 298.150 k
press: 1.00000 atm
elementType: 8 7 6 6 6 6 6 6 6 6 6 6 6 6 6 1 1 1 1 1 1 1 1 1 1 1 1 1 1 1 1 1
symmnumber: 1
zpe: 704778.3 jmol-1
zpe.correction: 0.268436 hartree
zpe.thermalcorrener: 0.283984 hartree
zpe.thermalcorrenthalpy: 0.284928 hartree
zpe.thermalcorrgfe: 0.224101 hartree
zpe.sumelectzpe: -634.439011 hartree
zpe.sumelectthermal: -634.423463 hartree
zpe.sumelectthermalent: -634.422519 hartree
zpe.sumelectthermalfe: -634.483345 hartree
dipole: 0.3750 1.2659 3.1969
dipole: 3.4588
quadrupole: -90.6673 -80.9036 -91.7231
quadrupole: -0.8037 -4.7963 1.4471
quadrupole: -2.9027 6.8611 -3.9584 -0.8037 -4.7963 1.4471
hfenergy: -634.7074466 hartree
pointgroup: C01 [X(C13H17N1O1)]
dipole: -0.2043168 -0.2033916 -1.3299155 debye
polarizability: 144.7326699|15.8852971|147.995593|-4.2160853|14.8906018|138.9921138 unknown
InChI: InChI=1S/C13H17NO/c1-10(2)13(15)14-11(3)9-12-7-5-4-6-8-12/h4-8,11,14H,1,9H2,2-3H3
charge 0 multiplicity 1
32 atoms
O  -1.356915 -0.109867 1.988331
N  -1.34569 -0.797362 -0.240977
C  -0.424705 -1.932362 -0.032971
C  0.828098 -1.816677 -0.939227
C  1.65289 -0.538191 -0.802697
C  -1.152562 -3.277557 -0.2604
C  2.401198 -0.074962 -1.916178
C  1.742249 0.183506 0.416499
C  -1.774205 0.02214 0.790581
C  3.225431 1.068269 -1.81939
C  2.565252 1.32847 0.515911
C  -2.763118 1.10525 0.413806
C  3.312454 1.775302 -0.59794
C  -2.636729 2.383533 1.213137
C  -3.729616 0.891043 -0.521399
H  -0.128625 -1.868668 1.02951
H  0.520027 -1.943002 -1.998194
H  1.472078 -2.691127 -0.710053
H  -0.475177 -4.12642 -0.053599
H  -1.505216 -3.370859 -1.305624
H  -2.025762 -3.360353 0.409089
H  -1.622052 -0.56192 -1.196418
H  2.339038 -0.617618 -2.868655
H  1.161792 -0.130653 1.291376
H  3.795211 1.406628 -2.692533
H  2.61861 1.87284 1.465696
H  3.949517 2.663297 -0.516933
H  -1.672514 2.884548 1.003088
H  -3.457331 3.08537 0.989823
H  -2.637479 2.146313 2.291831
H  -4.463805 1.667085 -0.764951
H  -3.846444 -0.069391 -1.037639
