program: Gaussian 09
title: 000216182
version: EM64L-G09RevD.01
frameworkgroup: C1[X(C17H19NO)]
method: RPBEPBE
basis: SDD
operation: Freq
keyword: #p
keyword: freq=noraman
keyword: PBEPBE/SDD
title: #p freq=noraman PBEPBE/SDD
converged: YES YES NO NO
title: Mulliken charges:
elementType: O N C C C C C C C C C C C C C C C C C H H H H H H H H H H H H H H H H H H H
charge: -0.285369 -0.065180 -0.480163 -0.182504 -0.322708 -0.361716 0.422283 -0.570109 0.502248 -0.403579 -0.388941 -0.406567 -0.413403 -0.225346 -0.225404 -0.242734 -0.227507 -0.226096 -0.242683 0.242332 0.237439 0.224048 0.224217 0.220995 0.233865 0.226750 0.204238 0.225561 0.226465 0.265418 0.231092 0.232703 0.223737 0.224696 0.227024 0.223781 0.223689 0.227427
chargesum: 0.00000
title: Mulliken charges with hydrogens summed into heavy atoms:
elementType: O N C C C C C C C C C C C C C C C C C
charge: -0.285369 -0.065180 -0.000392 0.041543 0.122504 0.098900 0.422283 -0.140310 0.502248 -0.177114 -0.123523 -0.175475 -0.180700 -0.001609 -0.000708 -0.015710 -0.003725 -0.002408 -0.015256
polarizability: 1.83227301e+02 1.32749303e+01 1.95093755e+02 -1.30020302e+01 -7.98168277e+00 1.64239428e+02
1716.lowfreq: -6.5562 -2.8487 -0.0007 -0.0006 -0.0003 9.6325 15.6463 20.2938 29.9851
frequency: 15.1103 20.2355 29.7051 44.0135 58.8979 79.9211 123.0210 146.8579 202.2229 220.4005 252.4472 294.3938 329.8878 358.6079 394.7904 403.0418 404.3714 409.1164 493.7635 508.9993 567.5974 580.2262 615.4801 617.7618 678.7610 700.0561 705.3510 711.2923 736.8662 752.7543 769.1325 782.7365 793.1358 814.5842 853.5055 858.0271 871.3894 914.3190 919.5661 924.3106 949.4437 975.4340 980.4882 986.0933 989.0909 990.0891 993.4909 1001.4574 1005.0351 1013.1523 1026.2733 1026.9469 1047.1687 1077.9573 1081.2396 1094.3901 1118.4417 1153.8694 1170.2645 1171.7705 1181.4122 1186.6370 1213.0245 1215.3859 1216.9682 1228.1291 1282.7672 1286.8903 1298.2943 1301.9930 1311.5588 1325.9208 1329.3606 1335.8418 1364.7669 1382.1602 1384.8441 1436.2211 1440.0770 1463.5357 1465.3077 1480.7170 1482.4417 1484.0093 1484.1447 1592.3183 1592.8849 1613.8733 1614.5801 2936.8978 2968.7105 2985.6936 2990.6668 3006.2383 3040.5827 3063.5067 3101.4751 3106.8524 3108.8710 3113.3024 3114.5512 3124.4332 3130.7559 3137.3665 3142.8043 3154.6864 3161.5750 3166.0208
redmass: 5.3644 3.7342 3.9946 3.8108 4.7722 3.3582 3.1801 3.2106 4.6341 4.7237 3.5220 3.3961 2.4739 4.2483 2.5611 2.7531 2.9027 2.2759 3.5511 3.0800 4.9921 4.1250 6.4362 6.3620 6.2352 4.0853 1.8499 1.8823 3.0637 1.9679 2.2499 3.3006 1.3420 4.0468 1.2470 1.2540 3.5266 2.3872 1.6387 1.7516 4.5757 1.3884 1.4060 1.9724 5.6716 6.2884 1.3235 1.3818 2.1065 2.3002 2.1415 2.1293 3.0694 1.7571 1.6620 1.6181 1.6029 1.1311 1.0568 1.0524 1.1103 1.1156 1.7846 1.5877 2.1118 1.3623 1.2138 1.3888 1.2760 1.5634 1.6182 1.2425 1.2281 1.3836 1.3190 8.0049 6.7833 2.1961 2.1783 1.1025 1.0945 1.4647 1.7431 1.1226 1.8342 6.2155 6.0599 6.1204 6.1746 1.0670 1.0833 1.0662 1.0616 1.0672 1.0928 1.1018 1.1003 1.0878 1.1016 1.0873 1.0870 1.0862 1.0906 1.0925 1.0958 1.0957 1.1015 1.0989
irintensity: 0.0186 0.0035 0.2152 0.1233 1.0003 0.1347 0.1641 3.7693 1.5316 5.6745 3.8429 0.2969 0.5372 2.8268 2.4909 0.6272 0.0770 5.8731 5.1780 21.0959 13.9698 5.5065 0.0929 0.0812 1.9940 23.0687 55.8291 84.5502 8.0961 13.9309 18.6847 142.8190 16.5094 18.8378 0.0165 0.2316 0.2067 3.5328 12.0408 8.2244 56.1328 0.0497 2.2174 22.5272 1.5002 0.2492 0.1358 3.4977 5.3775 12.7781 2.6968 4.9805 39.5499 2.9850 9.5090 41.2091 24.2789 0.3647 0.2548 0.1078 1.7176 0.3745 0.3500 1.3985 0.0497 3.5889 4.2112 1.1484 8.1077 8.3506 13.5770 4.0086 9.7514 5.2230 2.6274 0.1441 2.1664 8.1375 7.4347 11.9835 0.7936 5.1825 29.1746 8.1930 8.9315 0.7908 1.6020 10.5767 8.8096 35.6528 28.4693 66.4689 53.3147 76.5618 2.8098 26.5236 19.0365 11.8884 25.4684 9.1566 7.9241 0.5530 10.6316 28.1335 44.5682 28.9957 22.9408 14.1224
temp: 298.150 k
press: 1.00000 atm
elementType: 8 7 6 6 6 6 6 6 6 6 6 6 6 6 6 6 6 6 6 1 1 1 1 1 1 1 1 1 1 1 1 1 1 1 1 1 1 1
symmnumber: 1
zpe: 833556.8 jmol-1
zpe.correction: 0.317485 hartree
zpe.thermalcorrener: 0.334060 hartree
zpe.thermalcorrenthalpy: 0.335004 hartree
zpe.thermalcorrgfe: 0.269497 hartree
zpe.sumelectzpe: -787.774462 hartree
zpe.sumelectthermal: -787.757887 hartree
zpe.sumelectthermalent: -787.756943 hartree
zpe.sumelectthermalfe: -787.822450 hartree
dipole: 0.3866 0.1151 1.4700
dipole: 1.5243
quadrupole: -114.6078 -106.8619 -107.7461
quadrupole: 3.4470 -7.9944 -2.7115
quadrupole: -4.8692 2.8767 1.9925 3.4470 -7.9944 -2.7115
hfenergy: -788.0919475 hartree
pointgroup: C01 [X(C17H19N1O1)]
dipole: -0.1682206 -0.3596049 -0.4495013 debye
polarizability: 179.4908024|-16.8867816|191.4478612|-1.0065987|-16.2901844|171.6218201 unknown
InChI: InChI=1S/C17H19NO/c1-3-7-15(8-4-1)11-12-18-13-17(19-14-18)16-9-5-2-6-10-16/h1-10,17H,11-14H2
charge 0 multiplicity 1
38 atoms
O  1.765218 -0.490167 2.247856
N  0.049995 -1.783894 1.225827
C  1.32661 -2.198132 0.582671
C  2.41541 -1.157104 1.095492
C  0.503039 -1.276523 2.515109
C  -0.793659 -0.836435 0.438194
C  2.856466 -0.131868 0.057671
C  -2.266422 -0.859988 0.925671
C  -3.146773 0.059247 0.091898
C  3.682996 -0.547204 -1.018704
C  2.460995 1.224826 0.134829
C  -3.258303 1.439415 0.403125
C  -3.840094 -0.43435 -1.043406
C  4.091335 0.372463 -2.009722
C  2.872325 2.147075 -0.854352
C  3.684694 1.725449 -1.932042
C  -4.040038 2.303547 -0.396206
C  -4.623409 0.425223 -1.846555
C  -4.725384 1.798824 -1.525801
H  1.233603 -2.209679 -0.513954
H  1.595489 -3.212213 0.932452
H  3.302459 -1.712362 1.462969
H  -0.215246 -0.592702 2.991259
H  0.757342 -2.115131 3.192711
H  -0.404191 0.205346 0.472456
H  -0.764444 -1.157816 -0.618351
H  -2.300617 -0.555872 1.989956
H  -2.62223 -1.905235 0.87658
H  4.01407 -1.592518 -1.080986
H  1.84953 1.54247 0.985122
H  -2.734717 1.836911 1.282106
H  -3.769665 -1.500509 -1.293756
H  4.729239 0.03744 -2.835674
H  2.562172 3.195879 -0.781249
H  4.003061 2.441702 -2.697855
H  -4.117764 3.365943 -0.138046
H  -5.156325 0.025032 -2.716758
H  -5.334465 2.46651 -2.145537
