program: Gaussian 09
title: 000216149
version: EM64L-G09RevD.01
frameworkgroup: C1[X(C13H17NO)]
method: RPBEPBE
basis: SDD
operation: Freq
keyword: #p
keyword: freq=noraman
keyword: PBEPBE/SDD
title: #p freq=noraman PBEPBE/SDD
converged: YES YES NO NO
title: Mulliken charges:
elementType: O N C C C C C C C C C C C C C H H H H H H H H H H H H H H H H H
charge: -0.281003 -0.368808 -0.219787 -0.375627 0.486716 -0.710097 -0.391465 -0.450715 -0.243350 -0.221294 0.150520 -0.244395 0.336074 -0.783781 -0.676780 0.226078 0.255803 0.210663 0.223181 0.206701 0.232722 0.323506 0.230842 0.239615 0.225798 0.227775 0.230231 0.264407 0.215696 0.228990 0.228783 0.223000
chargesum: 0.00000
title: Mulliken charges with hydrogens summed into heavy atoms:
elementType: O N C C C C C C C C C C C C C
charge: -0.281003 -0.045302 0.006291 0.090840 0.486716 -0.047493 -0.160623 -0.211100 -0.017552 0.006480 0.150520 -0.014164 0.336074 -0.074687 -0.224997
polarizability: 1.54846769e+02 -1.55634555e+01 1.58321570e+02 -2.02487238e+01 1.59905333e+00 1.22748593e+02
1716.lowfreq: -14.5921 -5.9181 -0.0007 -0.0005 -0.0004 9.7495 11.0376 24.9436 31.2401
frequency: 7.3048 24.7573 30.9081 61.6199 75.6614 115.5591 147.3174 189.7785 206.6808 215.1757 225.8514 255.9290 318.7041 341.3442 348.4028 403.1077 425.4752 447.0500 536.3402 547.7348 560.1095 578.5888 607.6791 616.3666 649.8549 708.0372 733.8424 773.9993 777.6903 816.5675 855.0431 888.0522 920.8993 933.5136 955.7051 964.1842 977.4546 989.1230 995.3901 996.3185 1018.2201 1034.9923 1052.6328 1055.7371 1079.9470 1101.8137 1119.4345 1172.4066 1189.6351 1193.8301 1212.3726 1221.7089 1287.3113 1302.1310 1309.4974 1347.5536 1353.0749 1383.8279 1389.7256 1391.6164 1427.3997 1441.3898 1448.2495 1458.3453 1474.0565 1474.8956 1477.6488 1483.3380 1488.9295 1581.7397 1590.6336 1611.4732 1652.9102 2972.2397 2980.7197 2983.2541 3001.2768 3066.2209 3068.1933 3074.8605 3086.5419 3093.3226 3102.9533 3116.3049 3117.8672 3132.9751 3143.7299 3162.3992 3193.8443 3542.8842
redmass: 3.8341 3.7176 4.4189 4.0595 4.0128 3.8946 1.0655 3.2204 2.2618 1.3998 2.9641 2.4056 3.3339 3.7230 3.0730 2.8169 3.6369 3.1850 3.0458 2.8052 2.5330 3.5222 1.2781 4.6537 1.6459 1.6800 3.7426 1.9025 2.3605 3.3933 1.2501 1.7038 1.4273 2.0337 1.3324 1.7466 1.3980 5.3422 1.5767 1.3136 2.4579 1.9331 1.6831 1.8687 2.5811 2.0163 2.1008 1.0554 1.1301 2.2657 2.1473 1.2743 1.3036 2.3823 1.5003 1.3354 1.5343 3.6714 1.2369 1.2867 1.2124 2.0928 1.0483 1.1152 1.2137 1.0725 1.0598 1.9359 1.7412 6.5414 5.8988 6.0569 4.9055 1.0665 1.0361 1.0372 1.0831 1.0950 1.0968 1.0988 1.1000 1.0627 1.1010 1.0855 1.0876 1.0909 1.0958 1.1014 1.1138 1.0771
irintensity: 2.7944 0.1112 0.7322 4.8066 2.4084 2.1812 1.4193 1.2830 1.1603 0.4649 0.3101 0.4239 12.3463 5.4674 1.7641 0.0172 2.3651 4.5227 25.9263 2.5424 2.6719 2.3473 83.8698 9.1269 9.4499 57.9392 6.2805 37.0192 2.0629 1.6901 0.2352 15.5086 3.3468 2.5590 64.1971 2.1411 0.0970 0.6783 9.1475 0.1969 19.0347 7.2498 7.0272 6.5987 3.7715 6.0119 2.4205 0.1257 2.8304 63.3815 5.5470 70.6222 0.2924 4.3579 17.8222 3.8758 8.4462 2.8338 33.2158 9.8604 3.0689 9.2652 21.0901 24.8210 10.7628 27.3198 14.3635 132.3628 139.4691 190.8914 2.3407 4.5496 6.0383 23.1286 35.5233 16.8337 27.0421 16.5164 3.7594 41.6130 27.9767 5.9189 16.8575 9.5515 3.7019 10.4587 41.3478 21.6925 22.4709 20.8290
temp: 298.150 k
press: 1.00000 atm
elementType: 8 7 6 6 6 6 6 6 6 6 6 6 6 6 6 1 1 1 1 1 1 1 1 1 1 1 1 1 1 1 1 1
symmnumber: 1
zpe: 705145.9 jmol-1
zpe.correction: 0.268576 hartree
zpe.thermalcorrener: 0.284224 hartree
zpe.thermalcorrenthalpy: 0.285168 hartree
zpe.thermalcorrgfe: 0.222251 hartree
zpe.sumelectzpe: -634.438284 hartree
zpe.sumelectthermal: -634.422637 hartree
zpe.sumelectthermalent: -634.421692 hartree
zpe.sumelectthermalfe: -634.484609 hartree
dipole: 2.7371 -2.3387 -0.3686
dipole: 3.6190
quadrupole: -97.3436 -87.7112 -86.2385
quadrupole: 8.0606 -3.9661 -1.4487
quadrupole: -6.9125 2.7199 4.1926 8.0606 -3.9661 -1.4487
hfenergy: -634.7068602 hartree
pointgroup: C01 [X(C13H17N1O1)]
dipole: 1.0220839 0.8536706 0.5038192 debye
polarizability: 144.1540745|11.6140582|156.420452|27.0490222|7.7988052|135.3424052 unknown
InChI: InChI=1S/C13H17NO/c1-10(2)13(15)14-9-11(3)12-7-5-4-6-8-12/h4-8,11,14H,1,9H2,2-3H3
charge 0 multiplicity 1
32 atoms
O  -2.990585 -1.33375 -0.877853
N  -1.238509 -0.351015 0.308961
C  0.90783 -1.51767 -0.313546
C  -0.456851 -1.586998 0.434773
C  1.775302 -0.368735 0.209077
C  1.624219 -2.888119 -0.217472
C  2.286708 -0.378172 1.535209
C  2.071608 0.746727 -0.615769
C  3.073946 0.690383 2.01741
C  2.860565 1.819388 -0.137969
C  -2.466114 -0.307355 -0.335083
C  3.365058 1.794915 1.181861
C  -3.154813 1.041932 -0.370781
C  -4.034656 1.270002 -1.581076
C  -3.039687 1.932983 0.652731
H  0.679659 -1.319856 -1.37931
H  -1.077975 -2.395086 0.010688
H  -0.279297 -1.813959 1.505732
H  0.996524 -3.687253 -0.652932
H  1.83773 -3.161395 0.832796
H  2.585493 -2.868083 -0.760143
H  -0.809263 0.524247 0.615857
H  2.075436 -1.228929 2.194965
H  1.685939 0.77065 -1.642624
H  3.46213 0.662604 3.042058
H  3.08049 2.669213 -0.794151
H  3.977974 2.623014 1.554869
H  -4.722732 0.415146 -1.704711
H  -4.616672 2.202082 -1.489358
H  -3.429414 1.31878 -2.506357
H  -3.569222 2.892126 0.629657
H  -2.45312 1.723985 1.55529
