program: Gaussian 09
title: 000210774
version: EM64L-G09RevD.01
frameworkgroup: C1[X(C14H21NS2)]
method: RPBEPBE
basis: SDD
operation: Freq
keyword: #p
keyword: freq=noraman
keyword: PBEPBE/SDD
title: #p freq=noraman PBEPBE/SDD
converged: YES YES NO NO
title: Mulliken charges:
elementType: S S N C C C C C C C C C C C C C C H H H H H H H H H H H H H H H H H H H H H
charge: 0.178900 0.209061 -0.152703 0.429873 -0.451560 -0.469967 -0.385169 -0.364518 -0.398439 -0.401735 -0.109001 -0.402979 -0.726291 -0.724914 -0.289124 -0.163298 -0.514716 0.247961 0.199032 0.218285 0.252886 0.203990 0.215005 0.203447 0.204178 0.193517 0.201372 0.200532 0.192179 0.215185 0.192360 0.279656 0.245467 0.248311 0.278722 0.241466 0.241673 0.261355
chargesum: 0.00000
title: Mulliken charges with hydrogens summed into heavy atoms:
elementType: S S N C C C C C C C C C C C C C C
charge: 0.178900 0.209061 -0.152703 0.429873 -0.004567 0.001205 0.033827 0.043107 -0.003550 -0.009024 -0.109001 0.004565 -0.201167 -0.197880 -0.047659 0.078375 -0.253360
polarizability: 2.09349670e+02 1.38291790e+00 1.59239734e+02 -1.76500797e+00 -2.38559968e+00 1.75362043e+02
1716.lowfreq: -23.8666 -15.3109 -8.9086 0.0001 0.0011 0.0018 10.1208 50.6419 60.0359
frequency: -18.0678 50.5376 59.7474 70.3889 133.5391 135.4378 144.1581 209.8244 216.2895 235.0052 250.1591 286.9144 300.4896 314.4910 358.4681 390.8915 398.2016 417.0204 444.4236 469.5748 479.7089 502.3027 543.9424 592.7215 601.5325 615.2523 642.1078 649.9676 685.5988 690.1936 758.8806 784.5322 798.9654 804.1116 826.5324 845.1074 845.8005 861.0744 904.1112 906.5171 932.6175 936.0192 940.9491 954.8700 1001.5427 1025.3723 1032.6714 1053.8772 1060.9619 1071.1874 1073.3245 1077.9694 1114.0527 1118.0952 1129.2069 1145.6411 1149.3697 1150.2015 1205.1841 1211.0837 1224.2852 1243.7621 1249.9226 1261.5805 1270.6275 1286.0613 1292.7807 1317.3702 1318.8921 1327.0432 1334.5076 1340.5437 1347.6026 1348.8292 1352.2264 1371.7960 1423.0558 1432.0800 1450.7174 1452.1027 1461.5616 1466.0936 1468.3221 1472.8020 1475.2768 1485.8237 1534.0352 2874.7857 2880.3669 2970.0938 2980.9357 2981.6149 2985.4899 3002.1115 3027.9765 3029.5721 3034.1781 3040.4244 3046.8501 3050.3974 3055.7684 3062.5028 3071.0466 3101.2741 3102.5000 3164.6972 3182.4126 3235.1338
redmass: 4.9662 4.0744 3.3411 6.0480 3.9408 3.9024 2.7901 2.3216 2.5643 5.7647 3.9813 3.9291 2.4867 2.2027 2.8096 2.1445 3.0822 3.8590 2.9176 2.1430 2.9029 2.3119 2.5548 3.6434 7.7595 4.3395 4.1538 3.0678 6.2838 1.1808 3.3431 1.6262 3.0109 1.4846 1.6306 2.1716 2.5555 1.7953 1.3772 2.2434 2.2873 1.8126 2.4701 1.3270 2.7305 2.1912 2.3289 2.0967 1.8953 1.9605 1.9070 1.3245 1.8049 2.6120 2.3549 1.9163 1.3245 1.2227 1.3799 1.3116 1.4270 1.3337 1.9878 1.2625 1.1690 1.1938 1.2979 1.2967 1.3167 1.8828 1.3836 1.4457 1.4660 1.4621 1.4572 1.3337 1.0890 1.0905 1.0848 1.0866 1.0875 1.0904 1.0957 6.0879 1.1110 1.0937 5.1658 1.0713 1.0700 1.0620 1.0605 1.0620 1.0630 1.0601 1.0593 1.0600 1.0965 1.1023 1.0952 1.1018 1.0946 1.0925 1.0875 1.1071 1.1066 1.0892 1.0968 1.1003
irintensity: 0.2506 0.3036 0.1022 0.0716 1.2145 0.8152 0.5223 2.5004 2.0996 0.3581 0.5028 0.2428 2.5541 4.6347 0.3532 3.0709 0.7419 12.4980 0.5080 2.3568 0.0180 9.2130 1.0920 1.7610 1.2692 7.4802 0.4095 3.5199 3.5767 103.0438 14.8460 0.5375 8.5102 0.0378 7.6350 0.5864 2.1249 14.4847 0.3207 5.5272 57.4468 5.0050 20.5503 1.1775 2.6956 5.9597 3.9599 5.6584 10.6130 17.6610 13.1177 2.4726 0.2651 4.9505 6.6744 6.6706 3.5843 0.6323 7.8262 13.1169 33.5160 9.9528 7.4417 0.2564 3.2740 20.7309 2.7456 1.7316 2.7340 1.1674 0.1166 0.0274 2.2852 1.2389 1.2849 0.1296 5.3336 18.5018 13.4787 4.0560 15.8837 4.2811 11.8324 16.7783 9.0442 19.0003 1.9275 21.0251 78.5631 35.0111 43.9458 31.8041 25.1756 23.9408 19.1674 21.8594 75.6090 35.2583 11.2187 57.4211 38.7893 42.2321 31.0477 25.6388 5.3685 9.7757 5.7305 1.0558
temp: 298.150 k
press: 1.00000 atm
elementType: 16 16 7 6 6 6 6 6 6 6 6 6 6 6 6 6 6 1 1 1 1 1 1 1 1 1 1 1 1 1 1 1 1 1 1 1 1 1
symmnumber: 1
zpe: 846349.3 jmol-1
zpe.correction: 0.322357 hartree
zpe.thermalcorrener: 0.337924 hartree
zpe.thermalcorrenthalpy: 0.338868 hartree
zpe.thermalcorrgfe: 0.279972 hartree
zpe.sumelectzpe: -1395.617698 hartree
zpe.sumelectthermal: -1395.602132 hartree
zpe.sumelectthermalent: -1395.601187 hartree
zpe.sumelectthermalfe: -1395.660083 hartree
dipole: -1.8870 1.8412 0.8082
dipole: 2.7576
quadrupole: -123.1495 -122.7423 -110.1246
quadrupole: 5.2332 -1.0862 -0.9343
quadrupole: -4.4774 -4.0701 8.5475 5.2332 -1.0862 -0.9343
hfenergy: -1395.9400558 hartree
pointgroup: C01 [X(C14H21N1S2)]
dipole: -0.8578522 0.5907991 0.3034206 debye
polarizability: 207.7328447|9.1971167|161.0418367|0.0075638|-2.6813937|175.1767657 unknown
InChI: InChI=1S/C14H21NS2/c1-2-8-15(9-3-1)14(6-11-16-12-7-14)13-5-4-10-17-13/h4-5,10H,1-3,6-9,11-12H2
charge 0 multiplicity 1
38 atoms
S  3.475255 -1.725889 -0.07152
S  -2.253445 -1.12036 -1.423726
N  0.477525 0.790171 0.001322
C  0.265701 -0.714715 0.013981
C  0.988099 -1.329587 1.262844
C  0.908841 -1.36065 -1.258572
C  0.064755 1.503238 -1.239919
C  -0.040119 1.50833 1.200061
C  0.618274 2.945853 -1.257015
C  0.503838 2.952377 1.260413
C  -1.223713 -1.078575 0.085202
C  0.14112 3.735165 -0.019401
C  2.480014 -0.974555 1.350993
C  2.395532 -1.024577 -1.458167
C  -2.029281 -1.305082 1.196263
C  -3.426606 -1.513751 0.902128
C  -3.722235 -1.446753 -0.448007
H  0.868374 -2.42744 1.210888
H  0.496056 -1.003743 2.19785
H  0.349743 -1.066435 -2.168199
H  0.790787 -2.456142 -1.166227
H  -1.048157 1.541467 -1.339638
H  0.452054 0.964435 -2.119871
H  0.27489 0.972555 2.11078
H  -1.157905 1.534112 1.203482
H  0.292538 3.44412 -2.190669
H  1.725322 2.905801 -1.266464
H  1.605428 2.916641 1.372067
H  0.092532 3.454306 2.157771
H  0.591722 4.745451 -0.001388
H  -0.959207 3.87034 -0.069966
H  2.62959 0.117044 1.32911
H  2.931636 -1.392779 2.266569
H  2.782075 -1.488227 -2.381543
H  2.563459 0.063762 -1.49697
H  -1.635866 -1.337706 2.215224
H  -4.180385 -1.710897 1.668489
H  -4.678438 -1.5687 -0.953778
