program: Gaussian 09
title: 000210772
version: EM64L-G09RevD.01
frameworkgroup: C1[X(C16H23NS)]
method: RPBEPBE
basis: SDD
operation: Freq
keyword: #p
keyword: freq=noraman
keyword: PBEPBE/SDD
title: #p freq=noraman PBEPBE/SDD
converged: YES YES NO NO
title: Mulliken charges:
elementType: S N C C C C C C C C C C C C C C C C H H H H H H H H H H H H H H H H H H H H H H H
charge: 0.186976 -0.119267 0.272545 -0.453958 -0.454000 -0.351617 -0.353143 0.453321 -0.402924 -0.402934 -0.405763 -0.728663 -0.729206 -0.378842 -0.381304 -0.271307 -0.270490 -0.245844 0.192068 0.251503 0.251772 0.191819 0.192614 0.198622 0.199348 0.193003 0.189739 0.204138 0.204030 0.189789 0.214707 0.191355 0.245772 0.274054 0.274478 0.245891 0.225355 0.226239 0.225292 0.225226 0.229608
chargesum: 0.00000
title: Mulliken charges with hydrogens summed into heavy atoms:
elementType: S N C C C C C C C C C C C C C C C C
charge: 0.186976 -0.119267 0.272545 -0.010387 -0.010410 0.039619 0.039208 0.453321 -0.009047 -0.009114 0.000299 -0.208838 -0.208836 -0.153487 -0.155065 -0.046016 -0.045265 -0.016237
polarizability: 1.81071919e+02 4.37609016e+00 1.99734622e+02 3.61381625e-01 -1.40666924e-02 1.79450519e+02
1716.lowfreq: -27.5915 -0.0019 -0.0013 -0.0008 7.4559 11.6558 19.7594 54.9561 65.2387
frequency: -26.2300 54.9379 65.0499 67.4677 130.8501 144.9189 153.5407 216.8805 221.3418 233.9565 253.6157 276.9026 310.5699 311.1094 354.6001 393.2588 402.8831 411.8539 423.4024 441.2978 470.8475 487.6965 500.3573 532.5602 618.3089 623.5798 629.6244 650.9304 678.8765 704.1127 750.8877 790.9426 791.9859 803.1970 839.2660 850.7735 850.9736 867.9196 913.7781 918.4498 930.2321 939.9994 956.8361 975.1989 982.6249 992.2056 993.3859 1011.9639 1022.9372 1034.5689 1047.1774 1053.2357 1073.7525 1077.9110 1082.7524 1116.3981 1123.2192 1141.5105 1141.7645 1149.3233 1150.4613 1173.8883 1199.4478 1204.3242 1219.5447 1249.0284 1261.6995 1264.4181 1266.3090 1286.9616 1292.1481 1309.3369 1317.4220 1322.5840 1336.3606 1338.8613 1339.8023 1352.8997 1358.9203 1373.2938 1379.4280 1432.0517 1439.9249 1443.1273 1449.7409 1455.0030 1459.0191 1466.0796 1471.5336 1473.2712 1479.7978 1491.0968 1584.2174 1607.0098 2862.4487 2869.0769 2968.5446 2982.5515 2983.3743 2999.0197 3000.9791 3019.7526 3020.6975 3031.6813 3041.8077 3051.8834 3055.3217 3059.6523 3071.7317 3074.6662 3090.8991 3091.4109 3120.3402 3127.0306 3143.5510 3149.0514 3163.7119
redmass: 2.9466 4.0293 3.4846 6.4346 3.2400 2.7514 3.7252 2.6451 2.0917 4.5319 4.4894 2.7572 2.2196 2.6682 2.7525 2.1304 2.8459 3.2244 2.9154 2.9347 2.9675 2.1177 2.2532 2.9310 6.3769 4.1364 2.8109 4.8464 4.2867 1.6075 2.5356 1.5335 2.6182 1.4844 2.7827 1.2952 1.5057 2.1223 2.3596 1.4936 2.3511 1.5775 1.3238 1.3902 3.1252 5.2333 1.3471 2.7073 2.7757 2.4361 1.7389 2.2654 1.5980 2.4211 1.7547 2.7967 1.5645 1.4455 1.7560 2.2010 1.2426 1.0523 1.1213 1.4413 1.2638 2.0969 1.2582 1.6802 1.1901 1.1969 1.3262 1.3635 1.2773 1.3622 1.3394 1.4656 1.3992 1.4097 1.3899 6.6434 1.3022 1.9844 1.1513 1.0860 1.0894 1.0851 1.0885 1.1103 1.1721 1.0808 1.5002 1.2473 5.7456 6.0110 1.0717 1.0701 1.0615 1.0593 1.0629 1.0593 1.0600 1.0603 1.0594 1.0972 1.1028 1.1026 1.0985 1.0985 1.0863 1.0880 1.1060 1.1057 1.0841 1.0871 1.0909 1.0945 1.1009
irintensity: 0.1911 0.1292 0.0521 0.2315 2.2294 0.3001 0.1716 3.1822 0.6256 0.1508 0.2420 0.4206 4.5309 0.3810 0.5606 5.0084 0.0212 0.0635 9.3378 0.3964 0.0341 1.5301 6.8432 14.1845 0.0166 1.2600 10.5417 1.1045 6.7766 57.3986 12.9154 0.0343 24.0043 0.0086 2.2077 0.7875 3.0621 18.2125 1.1832 6.6693 15.7300 5.7906 2.2618 0.2106 35.9590 8.4943 1.4763 0.0974 11.9635 2.1138 1.2069 0.0678 7.7226 19.3931 12.2418 3.9595 2.5673 1.1553 0.5040 19.2592 0.4157 0.1040 1.0956 6.4723 3.0824 2.0906 0.5657 23.6303 0.1760 24.4310 3.1078 0.5295 3.8419 2.6813 0.0057 4.7574 0.0138 0.5072 4.5872 0.4821 0.0186 2.9206 8.6615 15.3134 4.9886 9.8094 15.4382 5.2057 10.6941 4.6807 33.7514 7.4210 1.9663 7.8095 21.0238 87.8683 33.2512 58.7410 36.8913 18.6113 27.4931 11.6164 31.5726 68.9682 25.1863 58.0954 5.3272 51.0023 58.6100 13.8364 33.2282 8.2252 3.6449 1.8190 23.4623 44.2850 17.0611
temp: 298.150 k
press: 1.00000 atm
elementType: 16 7 6 6 6 6 6 6 6 6 6 6 6 6 6 6 6 6 1 1 1 1 1 1 1 1 1 1 1 1 1 1 1 1 1 1 1 1 1 1 1
symmnumber: 1
zpe: 934395.3 jmol-1
zpe.correction: 0.355892 hartree
zpe.thermalcorrener: 0.371652 hartree
zpe.thermalcorrenthalpy: 0.372597 hartree
zpe.thermalcorrgfe: 0.313595 hartree
zpe.sumelectzpe: -1074.921662 hartree
zpe.sumelectthermal: -1074.905902 hartree
zpe.sumelectthermalent: -1074.904958 hartree
zpe.sumelectthermalfe: -1074.963960 hartree
dipole: -2.0991 1.7095 -0.0012
dipole: 2.7071
quadrupole: -127.5403 -118.3499 -106.4480
quadrupole: 5.6526 0.1057 -0.0036
quadrupole: -10.0942 -0.9039 10.9981 5.6526 0.1057 -0.0036
hfenergy: -1075.2775547 hartree
pointgroup: C01 [X(C16H23N1S1)]
dipole: 0.7054235 -0.7979661 -0.0027786 debye
polarizability: 182.975467|7.142387|197.8321133|-0.2695952|0.2780846|179.4494797 unknown
InChI: InChI=1S/C16H23NS/c1-3-7-15(8-4-1)16(9-13-18-14-10-16)17-11-5-2-6-12-17/h1,3-4,7-8H,2,5-6,9-14H2
charge 0 multiplicity 1
41 atoms
S  -3.054173 2.729902 -0.002017
N  1.241688 0.788584 0.014434
C  -0.290848 0.741655 0.002048
C  -0.772598 1.544595 -1.250793
C  -0.789878 1.525403 1.260098
C  1.899027 0.215222 1.225707
C  1.918975 0.248618 -1.201007
C  -0.782864 -0.733451 -0.014146
C  3.388518 0.620152 1.28895
C  3.409794 0.653343 -1.228446
C  4.145291 0.146874 0.030101
C  -2.296769 1.701202 -1.39235
C  -2.3156 1.682104 1.384183
C  -0.9421 -1.446196 -1.234738
C  -0.985458 -1.461902 1.1906
C  -1.294761 -2.813417 -1.25442
C  -1.338259 -2.8293 1.179323
C  -1.497876 -3.515982 -0.045308
H  -0.414057 1.073255 -2.183891
H  -0.297376 2.541621 -1.197336
H  -0.313096 2.522566 1.22775
H  -0.443384 1.040015 2.190533
H  1.825351 -0.90129 1.237942
H  1.398183 0.588983 2.13249
H  1.433976 0.648621 -2.105186
H  1.844073 -0.86701 -1.245811
H  3.839913 0.188771 2.203813
H  3.454067 1.722637 1.369035
H  3.47711 1.757491 -1.278396
H  3.876091 0.245677 -2.146678
H  5.19245 0.504112 0.043674
H  4.180281 -0.962191 0.015777
H  -2.54283 2.245405 -2.319767
H  -2.807328 0.722986 -1.412664
H  -2.828061 0.704722 1.3852
H  -2.572616 2.21462 2.315421
H  -0.796708 -0.934046 -2.191826
H  -0.874859 -0.962921 2.159303
H  -1.413753 -3.327969 -2.214965
H  -1.491743 -3.356453 2.128083
H  -1.776493 -4.575506 -0.057118
