program: Gaussian 09
title: 000216225
version: EM64L-G09RevD.01
frameworkgroup: C1[X(C20H24FN3O4S)]
method: RPBEPBE
basis: SDD
operation: Freq
keyword: #p
keyword: freq=noraman
keyword: PBEPBE/SDD
title: #p freq=noraman PBEPBE/SDD
converged: YES YES NO NO
title: Mulliken charges:
elementType: S F O O O O N N N C C C C C C C C C C C C C C C C C C C C H H H H H H H H H H H H H H H H H H H H H H H H
charge: 0.938658 -0.210835 -0.269508 -0.252939 -0.548524 -0.533365 -0.183486 -0.356415 -0.716772 0.026009 -0.486250 -0.461975 -0.365257 -0.455843 -0.513574 0.469381 0.147172 -0.409675 -0.347963 0.189908 -0.363526 -0.369829 0.313013 -0.367253 0.191787 -0.076348 -0.336874 -0.221553 -0.528807 0.236986 0.236566 0.204655 0.231830 0.221610 0.210078 0.224730 0.238052 0.252298 0.209404 0.243303 0.322457 0.238728 0.265529 0.253357 0.251615 0.297616 0.268936 0.286069 0.328360 0.337658 0.217344 0.235496 0.287967
chargesum: 0.00000
title: Mulliken charges with hydrogens summed into heavy atoms:
elementType: S F O O O O N N N C C C C C C C C C C C C C C C C C C C C
charge: 0.938658 -0.210835 -0.269508 -0.252939 -0.548524 -0.533365 -0.183486 -0.033958 -0.050754 0.262995 -0.045029 -0.008535 0.069550 0.034507 -0.060867 0.469381 0.147172 -0.170946 -0.082434 0.189908 -0.110169 -0.118213 0.313013 -0.069637 0.191787 -0.076348 -0.067938 0.064516 0.212000
polarizability: 3.73323100e+02 -2.44885243e+01 2.68867844e+02 -8.32064871e+00 -1.08046058e+01 2.04791298e+02
1716.lowfreq: -3.8857 0.0003 0.0009 0.0011 1.5810 3.8901 8.4063 12.4424 14.5624
frequency: 7.8644 12.2725 14.2113 21.5540 26.6698 35.4723 49.5466 55.4090 70.5482 79.2330 84.2274 95.2293 111.1346 127.8563 140.0953 157.0034 160.6795 177.0742 195.4748 211.1646 231.0191 243.0672 251.1217 266.7106 280.8999 289.4915 290.5247 308.8689 325.7994 334.4228 359.2848 370.6885 392.5181 393.9617 409.9810 415.2102 443.9371 454.3869 472.9706 487.6751 497.6651 510.7441 527.8390 555.0739 580.2353 587.2123 612.3054 621.0206 643.3036 648.2951 704.2343 721.6125 737.9827 742.4769 762.6072 790.8599 797.5728 803.8455 817.4157 823.6556 828.7031 832.1156 843.1805 849.5287 878.5751 900.0679 910.5139 920.9415 924.4308 943.2181 964.8625 970.4403 972.6058 973.5105 992.8395 1005.7174 1010.8017 1037.6597 1066.2262 1078.1689 1090.4954 1096.5649 1109.7916 1117.5405 1119.6569 1128.2752 1141.2828 1148.4716 1152.6890 1158.4945 1181.1061 1183.8605 1197.7325 1214.9819 1231.0610 1238.4434 1242.6322 1253.7516 1261.5280 1264.0854 1284.8351 1290.5405 1301.2459 1309.4463 1339.7386 1348.2213 1354.1995 1365.8768 1378.4216 1391.8231 1393.3286 1410.0410 1432.3157 1442.0293 1455.0417 1461.3504 1462.9048 1466.7482 1472.7271 1476.7767 1483.3729 1491.9800 1501.5033 1535.1032 1558.7346 1590.2761 1603.7052 1604.5428 1612.8189 2853.7515 2881.9536 2956.4216 2984.2350 2988.0559 2994.3584 2998.4227 3012.4039 3016.3204 3066.1339 3080.8261 3084.4467 3096.7900 3126.6096 3135.4694 3140.8728 3145.3360 3159.7304 3170.2528 3173.4596 3180.8808 3357.6850 3524.0111 3555.8079
redmass: 6.3633 7.5102 6.0677 4.4514 7.2552 3.8122 4.0597 2.9493 4.4585 5.2704 3.5432 1.7184 5.6437 4.3824 4.9758 5.8841 2.3041 3.5238 4.4582 2.7350 2.3093 4.8484 3.7931 4.1844 5.1024 4.7718 2.3184 3.9166 3.9931 4.8924 2.9643 5.9819 4.2965 4.8996 8.9284 3.0137 3.0023 3.4665 4.1821 4.2477 3.1278 4.4152 4.2079 1.8579 2.4365 1.7389 5.4860 6.1525 5.2747 5.4411 3.4681 5.4384 4.5760 4.2643 4.2888 3.5411 3.8759 1.9720 1.8200 2.0475 2.8326 1.5306 1.5352 2.0490 1.8671 2.2394 4.1474 2.1760 1.4851 1.4384 2.0700 5.6679 1.4627 1.3509 1.9941 2.7713 2.2693 2.3757 1.5891 1.9864 2.5951 1.3971 1.9916 1.3491 1.6158 2.5776 2.2700 1.6531 1.4307 1.4017 1.4103 1.8421 2.5620 1.9697 1.9190 3.3164 1.6519 1.4221 1.2357 1.6099 1.2536 1.3148 1.2249 1.3112 1.4391 1.4390 1.5799 1.7159 3.4317 6.1786 3.9521 2.3215 1.5571 1.1346 1.0671 1.1622 1.0941 1.7527 1.0687 1.1030 1.8242 2.5305 1.1000 1.0868 6.4135 7.2695 7.6942 7.1247 6.4404 1.0711 1.0827 1.0597 1.0332 1.0636 1.0879 1.0941 1.0713 1.0590 1.0990 1.1048 1.1047 1.0991 1.0899 1.1057 1.0914 1.0887 1.0890 1.0957 1.0958 1.0969 1.0415 1.0996 1.0781
irintensity: 0.7500 0.0657 0.6082 3.1617 0.8212 0.4915 0.7382 0.3491 2.1749 0.1721 0.2957 32.4877 4.5683 6.3124 4.8420 1.3733 0.2687 8.9482 9.4740 5.4480 1.3658 1.8765 0.7298 2.2247 2.8741 5.8135 7.5870 1.0416 2.8305 1.5557 14.7728 1.4157 1.6343 3.4574 86.6097 0.6529 6.5831 25.3803 80.1203 68.3493 8.1988 11.2123 23.8071 128.2435 8.2607 23.2109 0.2621 4.6864 2.1928 10.8293 1.4895 2.0094 14.4151 3.7068 1.4813 34.2658 21.9501 49.8009 64.4786 3.7470 125.6903 36.2016 37.7013 4.7963 1.6810 9.4297 75.0816 12.2585 9.9010 1.2043 8.8659 36.8840 0.7247 1.6785 9.7766 13.0011 7.9346 7.3141 28.7084 49.1118 13.2406 11.0975 24.8602 11.4901 0.5734 6.5466 82.1498 21.0115 16.8296 3.8111 0.8339 18.9426 20.7531 23.7403 22.9526 143.1013 19.5046 30.9928 12.4356 150.8298 25.5570 11.1298 8.5524 0.8813 11.2215 5.0889 29.2129 12.0480 50.8078 1.0047 3.7485 3.5572 2.7212 39.9830 36.1810 78.7961 8.6281 71.7425 60.6186 7.4630 190.1741 107.7738 8.8128 22.8077 30.8557 121.9821 6.0558 82.6921 9.0998 60.8348 62.4770 79.5589 48.1169 29.4425 25.5388 13.6088 45.3264 30.8826 28.9929 35.7345 26.4795 28.1434 11.1377 14.9685 2.2904 2.7835 1.6594 6.4443 5.3723 2.6070 24.2743 21.8866 19.0760
temp: 298.150 k
press: 1.00000 atm
elementType: 16 9 8 8 8 8 7 7 7 6 6 6 6 6 6 6 6 6 6 6 6 6 6 6 6 6 6 6 6 1 1 1 1 1 1 1 1 1 1 1 1 1 1 1 1 1 1 1 1 1 1 1 1
symmnumber: 1
zpe: 1084305.1 jmol-1
zpe.correction: 0.412990 hartree
zpe.thermalcorrener: 0.442497 hartree
zpe.thermalcorrenthalpy: 0.443441 hartree
zpe.thermalcorrgfe: 0.346560 hartree
zpe.sumelectzpe: -1737.232014 hartree
zpe.sumelectthermal: -1737.202508 hartree
zpe.sumelectthermalent: -1737.201563 hartree
zpe.sumelectthermalfe: -1737.298444 hartree
dipole: 1.4147 0.0630 4.7882
dipole: 4.9932
quadrupole: -214.6123 -174.4386 -173.8726
quadrupole: 13.2425 26.7918 -4.9960
quadrupole: -26.9711 13.2025 13.7686 13.2425 26.7918 -4.9960
hfenergy: -1737.6450041 hartree
pointgroup: C01 [X(C20H24F1N3O4S1)]
dipole: -0.5452981 -0.010283 -1.8872518 debye
polarizability: 369.4399379|31.5851363|272.8071486|-7.9737602|10.5441001|204.7351553 unknown
InChI: InChI=1S/C20H24FN3O4S/c1-28-19-9-8-17(29(22,26)27)11-18(19)20(25)23-12-16-3-2-10-24(16)13-14-4-6-15(21)7-5-14/h4-9,11,16,23H,2-3,10,12-13,22H2,1H3
charge 0 multiplicity 1
53 atoms
S  -5.612959 -2.017569 0.24549
F  8.591234 1.353438 -0.298911
O  -0.790219 1.942722 0.687354
O  -3.513497 3.635113 -0.059548
O  -4.381148 -3.033826 0.576481
O  -6.992646 -1.960996 1.109802
N  2.539849 -0.991973 -0.069531
N  -0.852986 0.413359 -1.064554
N  -6.05781 -2.392344 -1.509168
C  1.055247 -0.952395 -0.161679
C  0.683763 -2.355386 -0.696144
C  1.727132 -3.278348 -0.018205
C  3.013872 -2.410329 0.012961
C  0.605949 0.213724 -1.080164
C  3.14872 -0.056064 0.890098
C  4.605608 0.278797 0.572021
C  -1.462037 1.230961 -0.127211
C  5.500897 0.63146 1.612687
C  5.074253 0.282758 -0.765333
C  -2.971383 1.162558 -0.103355
C  6.836553 0.998448 1.333561
C  6.4058 0.641774 -1.068892
C  7.256155 0.994943 -0.007201
C  -3.549071 -0.135407 -0.053718
C  -3.843065 2.292843 0.035322
C  -4.921404 -0.282535 0.157983
C  -5.232138 2.0938 0.287167
C  -5.787403 0.809093 0.354367
C  -2.236229 4.108957 -0.623649
H  0.582974 -0.795692 0.839014
H  -0.355179 -2.639031 -0.454763
H  0.807301 -2.381201 -1.796851
H  1.869702 -4.23002 -0.557765
H  1.400752 -3.519368 1.010189
H  3.594978 -2.577747 0.943717
H  3.683841 -2.64673 -0.836478
H  0.939911 0.015542 -2.114219
H  1.068657 1.155559 -0.738061
H  3.089708 -0.441412 1.939414
H  2.554555 0.879602 0.877137
H  -1.434761 -0.108831 -1.72155
H  5.154883 0.621806 2.653411
H  4.377524 -0.006153 -1.55925
H  7.537733 1.273328 2.126907
H  6.782108 0.648281 -2.096276
H  -2.915683 -1.028222 -0.104965
H  -5.852509 2.985827 0.409891
H  -6.849093 0.653042 0.567979
H  -7.087966 -2.363149 -1.596482
H  -5.664813 -3.324577 -1.726252
H  -1.984864 3.552904 -1.54658
H  -2.421099 5.167135 -0.860844
H  -1.425399 3.995234 0.112143
