program: Gaussian 09
title: 000210768
version: EM64L-G09RevD.01
frameworkgroup: C1[X(C14H21N)]
method: RPBEPBE
basis: SDD
operation: Freq
keyword: #pfreq=noraman
keyword: PBEPBE/SDD
title: #p freq=noraman PBEPBE/SDD
converged: NO YES NO NO
title: Mulliken charges:
elementType: N C C C C C C C C C C C C C C H H H H H H H H H H H H H H H H H H H H H
charge: -0.143635 0.264717 -0.369532 -0.370548 -0.403719 -0.390966 -0.401887 0.387105 -0.776462 -0.792139 -0.378418 -0.414599 -0.247386 -0.243568 -0.246249 0.177370 0.236250 0.221876 0.163153 0.189676 0.204736 0.200593 0.187476 0.211989 0.187996 0.237680 0.236994 0.213752 0.229563 0.233182 0.216730 0.269680 0.240612 0.222372 0.220400 0.225207
chargesum: 0.00000
title: Mulliken charges with hydrogens summed into heavy atoms:
elementType: N C C C C C C C C C C C C C C
charge: -0.143635 0.264717 0.044088 0.014481 -0.009307 -0.002897 -0.001902 0.387105 -0.088036 -0.112664 -0.108738 -0.173987 -0.025014 -0.023168 -0.021042
polarizability: 1.84751462e+02 1.01262085e+01 1.45668712e+02 9.35717190e+00 -1.15661003e+01 1.23999736e+02
1716.lowfreq: -13.6234 -7.6260 -0.0005 -0.0003 0.0005 14.2758 44.4859 65.7027 70.4890
frequency: 44.4161 65.6119 70.4221 113.7586 181.7128 207.2888 247.3765 256.3851 269.8053 288.6624 301.1825 319.0605 329.9869 336.1335 387.0524 406.2093 440.0030 445.9605 472.2812 510.2313 561.6906 592.7016 617.8145 684.5450 707.9315 748.5981 773.6073 807.9426 840.9149 853.5558 858.6089 883.0343 910.3337 916.1552 930.4624 955.7067 958.4509 981.9876 988.5355 992.8911 1000.4975 1025.0300 1033.1286 1063.2011 1071.7060 1081.9977 1098.6002 1122.5028 1135.0492 1145.6504 1156.3981 1169.2548 1178.7492 1187.0180 1221.5690 1254.6619 1261.1240 1268.7674 1296.4158 1311.2922 1330.9173 1336.9320 1346.1201 1347.9825 1369.7211 1374.0589 1379.1731 1390.5378 1432.9915 1450.2662 1459.8014 1461.3115 1462.9276 1466.4764 1470.3984 1476.1675 1480.5417 1488.4878 1488.9534 1589.1306 1610.3797 2825.0351 2844.7943 2963.4033 2981.1811 2981.7480 2981.9714 2984.7608 3029.1224 3040.7605 3046.6967 3050.4391 3060.9363 3073.4093 3080.4630 3083.8638 3092.5549 3118.5809 3127.5527 3142.9694 3150.7753 3162.8413
redmass: 3.6178 3.5907 3.0253 2.9979 2.7439 2.5029 2.0238 1.9566 1.7225 1.3912 2.4574 1.7089 2.2754 2.4654 2.0594 2.8611 2.5819 2.8865 2.8875 2.1923 3.1073 2.7149 6.2957 3.6545 1.7106 3.0585 1.9003 1.4756 2.7864 1.4657 1.2592 2.5596 1.6878 1.9229 1.4776 2.3429 1.3358 1.3734 2.4701 1.8742 1.3296 2.4262 2.3096 1.7677 1.8870 1.4580 2.0059 2.7846 2.1046 1.2524 2.3161 1.0601 2.5145 1.1319 2.5585 1.9139 1.6573 1.1912 1.3883 1.3522 1.2669 1.4281 1.4512 1.4750 1.2406 1.8553 2.9092 1.2112 2.1983 1.0916 1.0865 1.0931 1.0897 1.1057 1.1078 1.1702 1.5608 1.0695 1.0862 6.1369 6.1203 1.0711 1.0700 1.0625 1.0430 1.0518 1.0618 1.0356 1.0963 1.1019 1.0901 1.1009 1.0893 1.0988 1.0992 1.0993 1.0998 1.0842 1.0879 1.0922 1.0949 1.1003
irintensity: 0.1399 0.0327 0.2611 0.8939 0.2964 0.3158 1.0939 0.5158 0.6778 0.1452 0.2998 0.1428 1.0352 0.2565 1.7809 0.1116 2.6666 0.1718 0.5783 6.2351 10.9218 3.1983 0.2072 2.5962 52.8087 5.3576 42.8937 0.0356 0.7848 7.9719 0.6709 4.3576 0.8070 3.0361 10.8414 26.9565 2.2602 0.3493 0.7058 1.3855 3.0095 19.3951 4.4994 6.8077 17.1972 10.0446 7.1932 6.5317 5.4815 6.1189 3.2917 0.2942 68.7443 4.9369 16.1559 27.1068 20.7891 13.2944 1.5484 1.1274 4.3756 0.3330 0.2985 1.6996 23.5531 5.6211 4.2858 17.9968 13.4405 5.6830 12.9188 3.1153 6.1037 3.2212 2.5880 5.7132 15.1902 10.9250 16.5038 0.6011 7.5798 70.7819 114.3895 39.7255 56.9077 18.1772 27.2270 22.8371 73.8823 37.1826 15.7492 80.6505 37.9875 20.0042 40.9661 50.9551 24.8612 0.7102 6.9920 18.4077 40.9608 21.5361
temp: 298.150 k
press: 1.00000 atm
elementType: 7 6 6 6 6 6 6 6 6 6 6 6 6 6 6 1 1 1 1 1 1 1 1 1 1 1 1 1 1 1 1 1 1 1 1 1
symmnumber: 1
zpe: 833670.1 jmol-1
zpe.correction: 0.317528 hartree
zpe.thermalcorrener: 0.331871 hartree
zpe.thermalcorrenthalpy: 0.332816 hartree
zpe.thermalcorrgfe: 0.277064 hartree
zpe.sumelectzpe: -599.673266 hartree
zpe.sumelectthermal: -599.658923 hartree
zpe.sumelectthermalent: -599.657979 hartree
zpe.sumelectthermalfe: -599.713730 hartree
dipole: 0.5895 0.5875 -0.3837
dipole: 0.9165
quadrupole: -88.7131 -89.5920 -92.3745
quadrupole: 1.2768 1.8326 -2.4030
quadrupole: 1.5134 0.6345 -2.1479 1.2768 1.8326 -2.4030
hfenergy: -599.9907944 hartree
pointgroup: C01 [X(C14H21N1)]
dipole: -0.2443901 0.1804981 0.1941724 debye
polarizability: 185.1105484|-10.9052422|138.3275055|7.813982|15.1579674|130.9818561 unknown
InChI: InChI=1S/C14H21N/c1-14(2,13-9-5-3-6-10-13)15-11-7-4-8-12-15/h3,5-6,9-10H,4,7-8,11-12H2,1-2H3
charge 0 multiplicity 1
36 atoms
N  -1.228246 0.250972 -0.075976
C  -0.074446 1.169649 0.25589
C  -1.374271 -0.893993 0.861958
C  -2.542559 0.895907 -0.316921
C  -2.314242 -1.96685 0.273562
C  -3.534651 -0.111766 -0.941895
C  -3.699278 -1.360585 -0.046795
C  1.239483 0.357969 0.107059
C  0.002932 2.318469 -0.794674
C  -0.219709 1.805615 1.672339
C  1.381999 -0.534248 -0.989028
C  2.344399 0.531626 0.977582
C  2.588445 -1.232317 -1.206861
C  3.556382 -0.166493 0.762437
C  3.685593 -1.050575 -0.331128
H  -1.787888 -0.563909 1.850086
H  -0.376508 -1.327633 1.049132
H  -2.413961 1.74699 -1.005376
H  -2.993319 1.2944 0.630601
H  -2.411973 -2.804111 0.991859
H  -1.859955 -2.369856 -0.65242
H  -3.148494 -0.416163 -1.934126
H  -4.51097 0.387412 -1.099151
H  -4.350683 -2.108407 -0.53781
H  -4.198509 -1.069057 0.901007
H  -0.074898 1.909577 -1.817404
H  0.976111 2.831453 -0.704633
H  -0.789682 3.073911 -0.647043
H  -1.213531 2.279349 1.767699
H  -0.117477 1.054309 2.475116
H  0.535276 2.594316 1.841209
H  0.518037 -0.682812 -1.64614
H  2.269561 1.208881 1.834368
H  2.675023 -1.918331 -2.057669
H  4.396769 -0.019846 1.451027
H  4.623938 -1.591849 -0.497678
