program: Gaussian 09
title: 000216199
version: EM64L-G09RevD.01
frameworkgroup: C1[X(C15H22N2O5)]
method: RPBEPBE
basis: SDD
operation: Freq
keyword: #p
keyword: freq=noraman
keyword: PBEPBE/SDD
title: #p freq=noraman PBEPBE/SDD
converged: YES YES NO NO
title: Mulliken charges:
elementType: O O O O O N N C C C C C C C C C C C C C C C H H H H H H H H H H H H H H H H H H H H H H
charge: -0.275930 -0.408668 -0.232186 -0.450738 -0.489255 -0.366886 -0.672704 -0.440121 -0.006039 -0.208644 -0.125555 0.194517 -0.630465 -0.716638 -0.715904 0.582534 0.154524 -0.505611 -0.411246 0.180061 -0.330481 0.134558 0.238754 0.238131 0.175290 0.239284 0.302497 0.219877 0.250329 0.229043 0.210357 0.208252 0.215639 0.215491 0.211666 0.356688 0.291244 0.288229 0.255977 0.235936 0.219674 0.381570 0.383061 0.373886
chargesum: 0.00000
title: Mulliken charges with hydrogens summed into heavy atoms:
elementType: O O O O O N N C C C C C C C C C C C C C C C
charge: -0.275930 -0.027097 -0.232186 -0.067676 -0.115369 -0.010198 -0.093231 0.036764 0.169251 0.030640 0.176943 0.194517 -0.160259 -0.068987 -0.073108 0.582534 0.154524 -0.249634 -0.175310 0.180061 -0.110807 0.134558
polarizability: 2.35788904e+02 1.32840021e+01 1.87398413e+02 -3.98964838e+00 2.35547558e+01 1.51934171e+02
1716.lowfreq: -8.3531 -4.0330 -0.0005 -0.0005 0.0007 7.9096 16.3894 18.9159 24.6997
frequency: 14.6171 18.7784 24.5977 34.3919 40.4214 44.7305 51.8278 70.3338 88.4402 124.5383 133.2157 142.8206 173.0289 200.2196 214.0414 229.0646 231.2584 247.4197 263.9649 267.9006 278.3960 288.9051 308.9991 327.1139 357.6387 386.0568 402.3865 416.1679 435.3078 440.9745 449.5924 483.2622 485.1339 511.5148 545.7214 554.9175 568.0848 612.7854 627.3236 639.4641 682.5449 684.4727 714.5165 728.6479 740.4352 763.7248 788.1416 813.2078 826.2466 847.8651 863.2467 869.5852 892.9262 913.5551 913.7901 933.5117 937.7080 941.4611 961.1715 975.7982 1016.1956 1060.0540 1073.0306 1081.1731 1104.9535 1124.0894 1139.9918 1145.8098 1153.9798 1175.7932 1180.5581 1182.5832 1200.3076 1219.2556 1241.8223 1262.3643 1266.5546 1273.0316 1273.7608 1297.0260 1298.5044 1309.8555 1318.9556 1326.7520 1331.9566 1343.3327 1350.6671 1378.0227 1394.3060 1408.5334 1459.1014 1465.1976 1468.4098 1469.9280 1472.6168 1481.0130 1483.2215 1488.7136 1504.7567 1611.5007 1619.0140 1632.8246 1638.8353 1651.4995 2936.5227 2967.2108 2970.6184 2975.5575 2987.1178 2993.3631 3004.2094 3050.5310 3061.5191 3065.5895 3067.0971 3069.4608 3071.6697 3120.2796 3146.3741 3154.4935 3377.3759 3461.2369 3507.3952 3524.3447 3582.1340 3624.7265
redmass: 4.0100 6.0413 6.6375 6.2742 5.6102 2.7648 5.3549 6.1729 2.8538 4.5313 4.9436 3.8828 5.2703 1.3362 1.5660 1.9938 1.4786 1.7842 1.3612 3.7999 4.5979 4.1330 3.5811 2.4527 5.3473 2.4297 2.6778 3.8008 3.3278 2.3999 3.1167 1.2671 3.6079 4.8580 3.6713 3.6035 5.3149 1.6909 4.2049 3.3185 2.4878 2.4853 3.5640 2.4898 4.8071 5.0662 1.4651 1.2723 2.4021 1.7828 1.8254 2.5154 2.2694 1.2873 1.3020 2.4395 2.1249 3.2036 1.8070 1.8821 2.6876 1.4647 2.2899 2.3284 2.4265 2.0925 2.1966 1.2796 1.7835 1.7489 1.8268 1.3916 1.5502 1.6439 1.8926 1.3140 1.4345 2.1584 1.3944 1.3458 1.3754 1.9131 1.4421 1.4368 1.6188 1.3372 1.5127 1.2075 1.2132 5.3923 1.0794 1.6685 1.8444 1.1782 1.0699 1.0540 1.6323 1.0512 3.2557 7.0786 8.3927 6.7553 1.1070 9.0971 1.0823 1.0351 1.0407 1.0743 1.0640 1.0689 1.0746 1.1012 1.0999 1.0995 1.1014 1.0991 1.0995 1.0880 1.0956 1.0929 1.0771 1.0458 1.0638 1.0648 1.0978 1.0666
irintensity: 2.7891 0.1598 2.6499 3.6945 1.9406 0.1279 0.9438 0.4822 1.5101 2.5685 0.6873 3.0644 1.2984 0.9079 1.0832 5.5149 5.9223 40.4839 127.4966 26.4323 3.4243 2.6761 3.2649 2.1490 1.1512 1.1769 0.2441 2.0301 12.6051 0.8049 12.2999 109.8791 55.4121 17.7518 27.0827 60.4010 2.6705 75.0451 21.8536 27.0653 55.2174 121.9278 7.2377 59.1146 0.3267 40.1525 51.4438 90.0151 34.9779 7.0513 8.1556 28.4933 44.9703 0.8742 3.9591 13.7149 6.0064 10.9494 1.9460 3.4436 17.3467 3.0194 232.5235 159.4720 20.2974 5.1310 12.6756 11.4226 71.3346 4.8873 9.2220 78.7650 17.6058 12.3426 66.9559 2.6874 53.2993 94.4075 3.0794 13.6155 14.1906 19.8276 40.7094 21.2893 5.5992 6.2954 2.3475 19.3980 13.4600 3.7106 1.8856 116.7084 50.9942 11.2236 14.6219 10.4307 130.1748 37.8418 134.9193 46.3870 176.2279 2.8397 40.4879 242.1497 38.0841 31.1408 14.6615 29.7320 27.1192 37.3021 5.0668 9.7782 13.1623 26.9886 11.0021 64.4530 79.5775 14.2041 14.3046 2.1162 142.4686 0.1397 24.8514 73.5511 5.9213 58.6687
temp: 298.150 k
press: 1.00000 atm
elementType: 8 8 8 8 8 7 7 6 6 6 6 6 6 6 6 6 6 6 6 6 6 6 1 1 1 1 1 1 1 1 1 1 1 1 1 1 1 1 1 1 1 1 1 1
symmnumber: 1
zpe: 936835.1 jmol-1
zpe.correction: 0.356822 hartree
zpe.thermalcorrener: 0.380908 hartree
zpe.thermalcorrenthalpy: 0.381852 hartree
zpe.thermalcorrgfe: 0.299793 hartree
zpe.sumelectzpe: -1068.752257 hartree
zpe.sumelectthermal: -1068.728170 hartree
zpe.sumelectthermalent: -1068.727226 hartree
zpe.sumelectthermalfe: -1068.809285 hartree
dipole: 2.1216 -0.3006 -1.9026
dipole: 2.8656
quadrupole: -131.6105 -104.7992 -136.0633
quadrupole: 7.9926 8.5950 18.7525
quadrupole: -7.4529 19.3585 -11.9056 7.9926 8.5950 18.7525
hfenergy: -1069.1090784 hartree
pointgroup: C01 [X(C15H22N2O5)]
dipole: 0.3657099 0.8798657 -0.6026301 debye
polarizability: 178.1546764|23.1911934|225.6992016|-21.6909395|25.1447072|171.2676099 unknown
InChI: InChI=1S/C15H22N2O5/c1-8(2)5-10(16)14(20)17-11(15(21)22)6-9-3-4-12(18)13(19)7-9/h3-4,7-8,10-11,17-19,21H,5-6,16H2,1-2H3
charge 0 multiplicity 1
44 atoms
O  1.435124 -1.585464 1.41412
O  0.241016 -4.128543 -1.979537
O  -1.661464 -4.673945 -0.76916
O  -0.767774 3.175393 -0.451554
O  -1.902493 3.411128 1.985405
N  0.585774 -1.75974 -0.763587
N  2.681436 -0.633237 -1.924198
C  2.517664 0.943531 0.018537
C  3.700867 1.888932 -0.321415
C  2.677176 -0.530354 -0.442364
C  -0.627526 -2.466009 -0.402432
C  1.513245 -1.35257 0.167469
C  -1.932867 -1.654977 -0.749803
C  3.328939 3.336199 0.083917
C  5.019755 1.448835 0.356697
C  -1.98541 -0.325282 -0.020355
C  -0.751008 -3.856605 -1.028658
C  -1.394149 0.829423 -0.593017
C  -2.580458 -0.229406 1.262036
C  -1.382074 2.046553 0.10947
C  -2.585001 0.995144 1.969799
C  -1.981467 2.126829 1.393101
H  1.58646 1.351831 -0.423333
H  2.370508 0.929695 1.115231
H  3.864092 1.884284 -1.422298
H  3.603718 -0.941896 0.009248
H  -0.592344 -2.60898 0.696423
H  -1.962641 -1.500568 -1.845541
H  -2.794351 -2.291312 -0.479331
H  2.391627 3.658536 -0.406696
H  4.1291 4.047405 -0.193129
H  3.1790 3.404875 1.178687
H  5.352503 0.450842 0.01669
H  4.894604 1.405585 1.455647
H  5.833382 2.164432 0.135353
H  0.842334 -1.518997 -1.734714
H  2.881915 0.252114 -2.398845
H  3.253922 -1.398588 -2.294141
H  -0.930194 0.793701 -1.583797
H  -3.038855 -1.1149 1.716177
H  -3.049509 1.058844 2.961779
H  0.084919 -5.040351 -2.349552
H  -0.861302 3.933452 0.184135
H  -2.294894 3.423856 2.890433
