program: Gaussian 09
title: 000210762
version: EM64L-G09RevD.01
frameworkgroup: C1[X(C16H26NS)]
method: RPBEPBE
basis: SDD
operation: Freq
keyword: #p
keyword: freq=noraman
keyword: PBEPBE/SDD
title: #p freq=noraman PBEPBE/SDD
converged: YES YES NO NO
title: Mulliken charges:
elementType: S N C C C C C C C C C C C C C C C C H H H H H H H H H H H H H H H H H H H H H H H H H H
charge: 0.374428 -0.145587 0.398788 -0.337121 -0.356948 -0.532448 -0.525677 -0.634301 0.539651 -0.458810 -0.445825 -0.401048 -0.405808 -0.397819 -0.401261 -0.195049 -0.884199 -0.591825 0.288339 0.243726 0.255215 0.255712 0.223346 0.210467 0.220819 0.219911 0.265755 0.264442 0.298742 0.232122 0.251664 0.252298 0.238088 0.225336 0.239082 0.237016 0.224874 0.210597 0.256027 0.238523 0.201911 0.261590 0.294133 0.291125
chargesum: 1.00000
title: Mulliken charges with hydrogens summed into heavy atoms:
elementType: S N C C C C C C C C C C C C C C C C
charge: 0.374428 -0.145587 0.398788 0.194943 0.153979 -0.098635 -0.084947 0.194637 0.539651 0.024976 0.044561 0.063371 0.056082 0.068805 0.039173 0.066541 -0.590066 -0.300700
polarizability: 2.05298202e+02 1.44662487e+01 1.78647271e+02 2.67030123e+00 -4.00777194e+00 1.62704962e+02
1716.lowfreq: -19.5875 -0.0013 -0.0005 0.0014 4.2737 12.4935 40.3602 69.7424 88.3735
frequency: 39.8411 69.6213 88.3534 106.0331 112.9425 159.8671 192.7145 205.3578 221.5158 230.5510 266.0640 273.7303 291.0383 310.5441 318.6606 347.2296 370.0840 392.6655 401.6877 427.1027 446.0921 472.2152 480.0846 487.5711 496.5029 529.8977 604.9266 623.3048 629.7697 689.2648 714.8791 724.6102 755.3188 780.8557 792.0815 801.8413 820.8821 832.3258 835.5624 857.7283 861.4556 874.6024 895.3462 901.1042 916.8890 933.3493 937.2121 950.1838 960.6454 978.9311 998.9531 1001.9025 1042.0178 1050.4919 1075.2183 1105.5709 1108.8049 1112.3371 1112.9623 1117.0879 1134.5134 1144.2512 1161.6526 1171.8729 1187.5488 1209.9829 1227.4658 1236.7002 1253.1148 1259.9232 1271.8604 1288.1411 1294.6754 1303.1568 1319.3646 1324.8413 1339.5191 1342.3960 1347.0945 1353.8370 1358.9617 1360.5774 1361.0512 1371.5791 1375.4592 1424.3606 1442.5158 1460.5274 1463.9309 1465.7012 1466.8969 1470.1529 1471.9230 1473.0111 1476.4329 1481.6654 1490.4587 1495.4650 1504.2380 1525.7321 2981.5902 2990.6914 3001.8069 3002.0404 3003.8845 3004.4239 3006.6559 3010.8934 3036.5621 3039.3895 3044.9790 3054.7222 3057.7735 3058.8666 3061.5508 3064.9433 3069.3522 3075.0045 3076.6035 3115.9923 3122.3026 3149.7041 3158.5273 3179.8161 3224.2209 3243.0807
redmass: 3.3415 5.8420 3.8034 2.8134 3.3219 2.7368 2.9756 1.7472 2.7265 4.1509 2.3928 2.9510 2.3570 2.1332 1.7654 2.5123 1.9521 2.1763 2.3921 2.7966 4.1822 2.8573 3.1780 2.2159 2.0570 2.8180 3.7977 2.2512 5.1872 3.6401 1.6967 1.8769 3.6901 1.5844 1.4559 1.6390 2.6792 2.2011 3.8782 1.7937 2.2868 2.1256 2.8901 1.3435 2.2041 1.4898 1.7910 2.0893 2.2444 2.0078 2.3071 2.2519 2.0789 2.2214 1.6348 1.7737 1.2073 1.6428 1.7090 1.3039 1.2878 1.4637 2.1422 1.3665 1.6387 1.6516 1.6058 1.6549 1.3073 1.2700 1.2224 1.5526 1.2517 1.3852 1.2813 1.2960 1.3423 1.3187 1.3517 1.4153 1.5313 1.4027 1.4999 1.3541 2.0010 1.1506 6.5508 1.0833 1.0840 1.0747 1.0898 1.0857 1.0876 1.0774 1.0836 1.0862 1.0872 1.0694 1.0566 5.4071 1.0660 1.0674 1.0606 1.0596 1.0625 1.0620 1.0619 1.0603 1.0630 1.0389 1.0599 1.0957 1.0975 1.0983 1.0955 1.0999 1.1025 1.1006 1.1013 1.1060 1.1067 1.1038 1.1016 1.0919 1.0950 1.1004
irintensity: 0.0976 0.2875 0.1017 0.6604 0.0348 0.0956 0.5702 0.4082 0.8213 1.5103 0.4289 1.0364 0.6203 0.5882 1.8262 0.1255 1.0546 0.1067 0.3857 0.8984 0.6874 0.0349 0.4062 1.3151 9.9070 1.0359 6.3078 22.1666 10.9566 128.8846 11.6725 0.5756 29.1200 1.9621 1.2770 54.6436 3.0710 1.5409 17.4851 18.3199 3.2068 2.4143 2.8201 1.5243 2.1947 10.5523 14.3261 2.0374 5.0702 9.6791 11.8927 18.5055 3.4677 7.0379 0.7002 0.0224 8.6398 5.0860 3.8586 1.2110 0.7613 2.2079 3.4813 1.9603 22.2222 4.9053 1.5558 11.1739 10.9163 0.6756 2.5254 12.3808 0.6843 7.2899 4.5040 22.4063 3.5970 5.7440 3.0032 1.2870 3.0876 1.4829 1.5286 7.1798 0.3266 25.6028 33.8771 2.7583 17.8143 18.6606 8.4011 16.4328 15.4867 5.7073 12.7519 1.6139 8.9458 57.2944 0.9020 4.3736 25.5453 17.2236 15.5978 22.8092 19.3218 15.4894 12.2472 24.3741 3.2510 8.2173 2.6418 25.5900 0.6490 42.6400 13.2817 6.6793 6.0357 33.2740 88.1964 3.3724 13.7116 1.0936 5.0376 1.4518 1.9385 3.7678
temp: 298.150 k
press: 1.00000 atm
elementType: 16 7 6 6 6 6 6 6 6 6 6 6 6 6 6 6 6 6 1 1 1 1 1 1 1 1 1 1 1 1 1 1 1 1 1 1 1 1 1 1 1 1 1 1
symmnumber: 1
zpe: 1029292.8 jmol-1
zpe.correction: 0.392037 hartree
zpe.thermalcorrener: 0.409256 hartree
zpe.thermalcorrenthalpy: 0.410200 hartree
zpe.thermalcorrgfe: 0.348562 hartree
zpe.sumelectzpe: -1076.454623 hartree
zpe.sumelectthermal: -1076.437403 hartree
zpe.sumelectthermalent: -1076.436459 hartree
zpe.sumelectthermalfe: -1076.498098 hartree
dipole: 4.4349 0.2197 -0.3349
dipole: 4.4530
quadrupole: -87.4881 -100.8154 -101.8948
quadrupole: -0.5344 -2.1654 -2.7870
quadrupole: 9.2447 -4.0826 -5.1620 -0.5344 -2.1654 -2.7870
hfenergy: -1076.8466597 hartree
pointgroup: C01 [X(C16H26N1S1)]
dipole: -1.7434604 0.1163115 0.1269665 debye
polarizability: 204.8528028|-14.7785939|179.2999363|3.1892984|3.4812339|162.4976962 unknown
InChI: InChI=1S/C16H26NS/c1-17(11-6-3-7-12-17)16(9-4-2-5-10-16)15-8-13-18-14-15/h8,13-14H,2-7,9-12H2,1H3
charge 1 multiplicity 1
44 atoms
S  3.192706 -2.298904 0.649709
N  -1.243092 -0.130535 0.391808
C  0.275137 0.579914 0.073401
C  -1.540095 -1.223443 -0.661596
C  -2.378027 0.915202 0.335951
C  0.188617 1.37011 -1.261929
C  0.577065 1.582771 1.22198
C  -1.209571 -0.763124 1.773533
C  1.29657 -0.553466 -0.000891
C  -2.944749 -1.845885 -0.534417
C  -3.778027 0.30142 0.527889
C  1.512452 2.135734 -1.545959
C  1.883063 2.385043 0.954048
C  -4.061541 -0.778912 -0.537223
C  1.836447 3.119684 -0.402176
C  1.648576 -1.265908 -1.220145
C  2.049454 -1.004006 1.08444
C  2.628776 -2.223337 -1.04942
H  -0.75313 -1.986627 -0.563473
H  -1.438156 -0.736756 -1.64537
H  -2.329182 1.385978 -0.65792
H  -2.166296 1.676216 1.102762
H  -0.609241 2.131439 -1.198614
H  -0.044612 0.715636 -2.119704
H  0.667156 1.073918 2.197035
H  -0.249589 2.312982 1.305361
H  -1.19906 0.023616 2.540632
H  -2.10165 -1.385535 1.917417
H  -0.311422 -1.391158 1.85467
H  -3.016856 -2.480593 0.368381
H  -3.064301 -2.532249 -1.393282
H  -4.505863 1.129217 0.441826
H  -3.89986 -0.108823 1.547212
H  1.399662 2.677813 -2.502648
H  2.344741 1.419572 -1.678378
H  2.751494 1.701204 0.976738
H  2.020506 3.10661 1.780197
H  -4.12152 -0.304435 -1.537132
H  -5.040529 -1.253416 -0.351891
H  2.803914 3.617827 -0.593524
H  1.068444 3.919084 -0.369559
H  1.205717 -1.066597 -2.198606
H  2.057785 -0.644752 2.112279
H  3.075782 -2.886927 -1.787014
