program: Gaussian 09
title: 000210757
version: EM64L-G09RevD.01
frameworkgroup: C1[X(C14H26N2)]
method: RPBEPBE
basis: SDD
operation: Freq
keyword: #pfreq=noraman
keyword: PBEPBE/SDD
title: #p freq=noraman PBEPBE/SDD
converged: NO YES NO NO
title: Mulliken charges:
elementType: N N C C C C C C C C C C C C C C H H H H H H H H H H H H H H H H H H H H H H H H H H
charge: -0.171873 -0.054276 0.510640 -0.520498 -0.541446 -0.385361 -0.389160 -0.557408 -0.394761 -0.368065 -0.367366 -0.396248 -0.397704 -0.028443 -0.614951 -0.614347 0.192985 0.225156 0.215414 0.199514 0.216034 0.183887 0.183910 0.218343 0.213552 0.212831 0.185761 0.196881 0.208239 0.191565 0.192628 0.207675 0.203402 0.181376 0.181371 0.203611 0.220729 0.221710 0.186224 0.221669 0.211951 0.214850
chargesum: 0.00000
title: Mulliken charges with hydrogens summed into heavy atoms:
elementType: N N C C C C C C C C C C C C C C
charge: -0.171873 -0.054276 0.510640 -0.102357 -0.126519 0.014561 0.013094 -0.131025 -0.012119 0.031738 0.032936 -0.011469 -0.012723 0.192286 0.014651 -0.187546
polarizability: 1.94127103e+02 1.04660061e+01 1.50932741e+02 -5.01182268e+00 -7.20558261e+00 1.44810365e+02
1716.lowfreq: -29.0489 -9.5205 -6.2333 -0.0001 0.0006 0.0007 31.0629 41.6571 48.2665
frequency: 30.4869 41.0065 48.1576 71.8791 120.8102 148.9772 156.0186 203.7477 223.7149 227.4209 253.5639 267.5449 278.3352 294.9341 339.4643 354.0010 373.7919 383.0094 401.9264 416.5192 475.1161 482.5312 491.7180 498.4190 535.2098 578.0787 663.1875 703.4287 757.9009 778.1130 780.6391 840.4418 847.7758 850.1823 874.6080 910.6540 927.2025 933.5025 939.3477 952.6736 954.4972 974.1840 1001.5914 1010.6317 1040.8503 1044.5664 1048.0230 1069.1874 1071.7646 1080.1132 1092.9578 1094.1919 1105.9290 1129.6006 1133.9005 1147.4703 1154.0255 1156.9256 1187.9542 1195.8250 1223.6653 1244.4583 1258.4981 1264.0285 1278.2742 1285.3926 1287.3250 1295.1311 1307.4292 1311.2853 1322.6288 1336.0909 1339.6451 1344.0142 1346.1498 1351.8421 1355.7641 1370.1894 1373.5903 1423.0989 1427.7276 1450.3884 1451.6455 1452.9246 1453.2663 1457.5483 1461.3257 1464.0939 1467.3897 1472.4120 1478.8975 1481.2265 1496.1890 1648.8118 2836.7887 2841.5462 2859.2424 2871.0287 2879.5910 2955.6096 2958.5908 2977.6718 2979.5865 2985.8636 2990.8207 3015.1779 3018.3328 3022.1134 3022.3313 3023.2658 3027.6226 3032.8941 3042.6786 3051.6717 3067.8233 3070.7211 3073.6245 3077.4613 3090.9251 3190.5077
redmass: 2.6750 2.8367 3.1861 3.1551 3.0320 2.6911 2.7571 1.9988 2.6368 1.3236 2.3638 2.3292 2.0962 1.8869 2.3078 2.5043 2.3223 2.1248 2.1669 2.3042 2.2070 2.7774 2.4876 2.9360 1.5934 2.3884 2.1330 2.3314 3.5661 2.2627 1.5060 2.7356 1.8230 1.5923 1.6370 1.6057 1.8289 1.3763 1.6372 2.3592 2.0795 2.5687 1.1581 2.3832 1.9149 1.7386 1.6138 2.3786 1.7135 2.1578 1.5672 1.7541 1.2869 1.7408 2.8121 2.6926 2.4274 1.9249 1.4579 1.3053 1.8837 1.3017 1.3758 1.3337 1.3762 1.6449 1.3253 1.5172 1.3619 1.3914 1.4409 1.2913 1.3661 1.3956 1.3899 1.4236 1.4432 1.4576 1.3619 1.1699 1.1694 1.0816 1.0849 1.0850 1.1065 1.0780 1.0815 1.0884 1.0940 1.1030 1.0793 1.0547 1.0863 4.5460 1.0704 1.0645 1.0616 1.0711 1.0692 1.0605 1.0625 1.0597 1.0612 1.0615 1.0632 1.0726 1.0879 1.0977 1.0919 1.0946 1.0990 1.0998 1.1020 1.1015 1.0860 1.0876 1.1009 1.0671 1.0852 1.1144
irintensity: 0.0296 0.0012 0.4305 0.0048 1.0902 0.3368 0.4572 0.0841 0.8736 0.0130 0.2928 0.0760 2.6611 1.6761 14.9170 0.0986 0.2289 2.3518 0.1250 0.2390 4.2870 0.0617 5.8356 0.3520 4.1447 3.4454 1.0424 17.5355 9.5789 6.2920 1.2538 5.5404 2.4751 0.4552 0.5156 4.0996 6.1579 66.0006 16.7103 14.9423 13.6485 52.2494 11.7675 20.8846 3.5377 2.1679 2.2883 14.2881 8.7998 11.7380 11.1282 13.9672 0.6360 2.5294 12.4868 23.3736 42.2244 15.1943 4.3252 1.6656 6.6138 1.0510 1.3662 4.5652 11.5534 21.2665 10.0427 14.4045 24.0776 0.2855 5.5698 0.2761 0.1111 1.5226 8.0882 2.0133 2.7604 1.3319 3.4899 3.5166 1.0660 2.5000 2.6673 3.2869 7.4218 28.1884 10.8712 4.9515 16.8350 12.8788 6.6499 12.2157 18.6864 33.1526 66.7984 40.8039 142.9006 17.1311 220.5324 29.9878 35.6948 17.1639 48.2305 73.5483 14.3817 44.7363 53.8260 3.5996 108.5435 19.7785 65.3281 7.5347 2.0258 128.0149 51.9976 11.8674 37.1283 28.8814 11.6792 31.1615
temp: 298.150 k
press: 1.00000 atm
elementType: 7 7 6 6 6 6 6 6 6 6 6 6 6 6 6 6 1 1 1 1 1 1 1 1 1 1 1 1 1 1 1 1 1 1 1 1 1 1 1 1 1 1
symmnumber: 1
zpe: 993475.1 jmol-1
zpe.correction: 0.378395 hartree
zpe.thermalcorrener: 0.395113 hartree
zpe.thermalcorrenthalpy: 0.396057 hartree
zpe.thermalcorrgfe: 0.334149 hartree
zpe.sumelectzpe: -657.239934 hartree
zpe.sumelectthermal: -657.223216 hartree
zpe.sumelectthermalent: -657.222272 hartree
zpe.sumelectthermalfe: -657.284180 hartree
dipole: 0.4176 0.5446 -0.0807
dipole: 0.6910
quadrupole: -98.0058 -105.9939 -97.0518
quadrupole: 0.7955 0.9555 -2.0743
quadrupole: 2.3447 -5.6434 3.2987 0.7955 0.9555 -2.0743
hfenergy: -657.6183291 hartree
pointgroup: C01 [X(C14H26N2)]
dipole: -0.1293404 -0.2372673 -0.0296731 debye
polarizability: 189.9415154|16.6629015|155.2447381|3.3799034|7.7107517|144.6839561 unknown
InChI: InChI=1S/C14H26N2/c1-3-7-14(8-5-4-6-9-14)16-12-10-15(2)11-13-16/h3H,1,4-13H2,2H3
charge 0 multiplicity 1
42 atoms
N  -0.489509 0.010045 -0.040401
N  -3.396114 0.123842 0.027417
C  0.991069 0.288842 -0.128536
C  1.691569 -0.178295 1.183921
C  1.615353 -0.556011 -1.282656
C  1.502494 -1.690316 1.448144
C  1.41225 -2.074722 -1.076313
C  1.25086 1.830901 -0.367515
C  2.034758 -2.534069 0.264603
C  -1.284607 0.205918 -1.276682
C  -1.213352 0.609109 1.107316
C  -2.670525 -0.448189 -1.128988
C  -2.598884 -0.043036 1.263595
C  2.694974 2.243137 -0.543377
C  -4.764248 -0.408844 0.15809
C  3.392465 3.037515 0.30969
H  1.348708 0.415767 2.052626
H  2.770639 0.046973 1.077516
H  2.7027 -0.345705 -1.29627
H  1.230091 -0.234588 -2.269539
H  0.4258 -1.904362 1.589509
H  2.024727 -1.974078 2.383269
H  1.867875 -2.631766 -1.918865
H  0.329593 -2.303822 -1.07171
H  0.815776 2.392487 0.482035
H  0.684274 2.123399 -1.276762
H  3.138632 -2.426798 0.20846
H  1.825148 -3.608029 0.435659
H  -0.769951 -0.263162 -2.131087
H  -1.437096 1.287374 -1.515749
H  -1.361295 1.710508 0.985862
H  -0.645001 0.441819 2.03696
H  -3.263181 -0.264709 -2.045702
H  -2.532228 -1.555796 -1.020105
H  -2.456789 -1.126034 1.517429
H  -3.139281 0.438124 2.101292
H  3.201648 1.877056 -1.449749
H  -5.28076 0.093183 0.996216
H  -4.795483 -1.513145 0.344654
H  -5.333471 -0.203241 -0.766591
H  4.437538 3.309205 0.121029
H  2.934731 3.440011 1.222503
