program: Gaussian 09
title: 000210755
version: EM64L-G09RevD.01
frameworkgroup: C1[X(C13H26N2)]
method: RPBEPBE
basis: SDD
operation: Freq
keyword: #pfreq=noraman
keyword: PBEPBE/SDD
title: #p freq=noraman PBEPBE/SDD
converged: YES YES NO NO
title: Mulliken charges:
elementType: N N C C C C C C C C C C C C C H H H H H H H H H H H H H H H H H H H H H H H H H H
charge: -0.175959 -0.054130 0.528509 -0.487946 -0.516891 -0.479469 -0.412453 -0.417093 -0.391500 -0.367211 -0.358004 -0.399259 -0.395222 -0.727474 -0.615543 0.204921 0.208675 0.222771 0.189645 0.216458 0.197640 0.192319 0.205599 0.205552 0.193727 0.201410 0.187452 0.206278 0.195635 0.179447 0.202210 0.202135 0.181070 0.182663 0.201866 0.214956 0.246724 0.202570 0.185860 0.221005 0.221055
chargesum: 0.00000
title: Mulliken charges with hydrogens summed into heavy atoms:
elementType: N N C C C C C C C C C C C C C
charge: -0.175959 -0.054130 0.528509 -0.074350 -0.104474 -0.065370 -0.014535 -0.017814 -0.002638 0.034703 0.023653 -0.016055 -0.010693 -0.063224 0.012378
polarizability: 1.79639137e+02 -1.40348963e+00 1.39452405e+02 -4.80053614e-01 2.25826879e+00 1.32472315e+02
1716.lowfreq: -16.6312 -12.8772 -7.4383 0.0002 0.0004 0.0005 29.8203 55.2876 83.1335
frequency: 29.2240 55.1955 83.0186 111.9717 148.6799 162.1480 177.2851 210.1240 224.2096 243.3621 247.7146 275.7612 286.7809 330.0194 342.6968 347.2391 368.4460 394.1101 426.2152 452.7484 471.1040 485.7467 508.6590 528.7963 619.7807 675.4766 751.9552 759.5725 778.3320 810.6706 822.3108 849.3286 855.8498 904.3021 917.2809 925.5768 936.1988 960.4795 995.3983 1010.7299 1018.4711 1037.2438 1047.2452 1049.9028 1068.0368 1074.4560 1079.1292 1089.0038 1104.8223 1117.8545 1132.7446 1140.9003 1143.1659 1149.4861 1173.4241 1193.6055 1198.1856 1230.3661 1248.2701 1266.1727 1269.8962 1279.6398 1290.0050 1299.7102 1304.0146 1320.4860 1329.8666 1332.2080 1334.6862 1341.6494 1350.0520 1351.4934 1353.8563 1371.2219 1376.0766 1386.3457 1428.5544 1448.7367 1450.4106 1456.3976 1457.2476 1460.1319 1464.0893 1467.1588 1468.5123 1473.2474 1478.0058 1481.5492 1483.9624 1489.5634 1499.1781 2838.9548 2843.1019 2859.9436 2869.7701 2883.1017 2962.6279 2963.5264 2973.1795 2976.2339 2981.8188 2983.6276 2988.5957 3013.5309 3015.7573 3018.7203 3020.2255 3022.7809 3028.3628 3035.8749 3044.0251 3049.3276 3064.4887 3069.4104 3071.8063 3072.8281 3090.2770
redmass: 2.7135 3.1853 1.9811 2.7992 1.6515 2.3167 2.0932 1.7519 1.6386 1.9310 2.7798 2.1050 1.8824 2.1941 2.3811 2.2468 2.0003 2.0415 2.6672 3.0086 2.3128 2.7046 2.9389 2.1832 2.2084 2.6236 1.5564 3.4027 1.4666 1.8969 2.1793 1.5819 1.7908 2.1886 1.9386 1.4648 1.8536 2.7205 1.9721 2.2981 1.5815 2.1646 1.6189 2.1639 1.5866 1.5471 1.6657 1.7652 1.8917 1.8580 1.8252 1.8396 3.0225 2.6826 2.4160 1.1604 1.6473 2.0586 1.3174 1.3071 1.3582 1.4832 1.5719 1.3935 1.4452 1.3271 1.3614 1.3846 1.4723 1.4408 1.3536 1.3972 1.4005 1.4364 1.3381 1.2172 1.1713 1.0799 1.0789 1.0705 1.0898 1.0672 1.0844 1.0858 1.0648 1.1038 1.0766 1.0546 1.0872 1.0484 1.0825 1.0698 1.0641 1.0629 1.0698 1.0693 1.0612 1.0604 1.0639 1.0612 1.0382 1.0639 1.0646 1.0728 1.0880 1.0964 1.0904 1.0964 1.1006 1.1008 1.0938 1.0999 1.0883 1.0981 1.1007 1.0874 1.0989
irintensity: 0.0962 0.7078 0.0074 0.0883 0.0079 1.6572 0.1525 0.1517 0.2842 1.2717 0.3179 1.4061 1.7405 0.7960 9.1972 4.8586 0.1455 0.0314 0.4834 1.2656 0.2582 0.1191 0.3344 2.1340 3.1601 2.9101 8.6796 9.7664 0.4091 1.1802 4.9140 0.5407 4.0950 10.5563 1.6898 3.0047 6.0120 40.3101 35.5103 12.1149 2.2803 2.0403 1.6627 0.0892 3.8422 2.7958 1.6177 12.7368 0.8122 16.8365 3.9435 3.1937 27.9420 48.1014 13.7475 0.6043 2.6507 3.3299 3.9130 5.8873 3.3838 6.4054 22.1072 0.7305 10.5786 3.4027 13.3795 0.4107 0.9560 0.6828 2.3032 3.7141 7.8931 2.4680 5.1477 20.4543 1.2139 0.6522 0.1201 1.1716 8.7817 26.9929 11.0344 13.2934 4.5682 12.8631 14.0299 7.6232 7.9968 0.6555 19.0623 69.5311 42.5365 121.5601 92.5713 159.0349 33.7306 28.4350 30.3941 49.8589 40.2993 41.6760 5.3524 42.2940 51.6905 47.3078 81.4204 84.0612 8.1374 39.7282 23.5553 97.9487 28.7135 64.9742 35.3250 31.2303 43.2246
temp: 298.150 k
press: 1.00000 atm
elementType: 7 7 6 6 6 6 6 6 6 6 6 6 6 6 6 1 1 1 1 1 1 1 1 1 1 1 1 1 1 1 1 1 1 1 1 1 1 1 1 1 1
symmnumber: 1
zpe: 981457.2 jmol-1
zpe.correction: 0.373817 hartree
zpe.thermalcorrener: 0.389704 hartree
zpe.thermalcorrenthalpy: 0.390649 hartree
zpe.thermalcorrgfe: 0.331419 hartree
zpe.sumelectzpe: -619.214446 hartree
zpe.sumelectthermal: -619.198558 hartree
zpe.sumelectthermalent: -619.197614 hartree
zpe.sumelectthermalfe: -619.256844 hartree
dipole: 0.2966 -0.0457 -0.0963
dipole: 0.3151
quadrupole: -92.0912 -95.4009 -95.8264
quadrupole: -1.2603 1.2656 3.5602
quadrupole: 2.3483 -0.9614 -1.3869 -1.2603 1.2656 3.5602
hfenergy: -619.5882629 hartree
pointgroup: C01 [X(C13H26N2)]
dipole: -0.1172186 0.018248 -0.0360204 debye
polarizability: 179.5540219|-2.3412602|139.234914|-0.6452971|-2.6195001|132.774922 unknown
InChI: InChI=1S/C13H26N2/c1-3-13(7-5-4-6-8-13)15-11-9-14(2)10-12-15/h3-12H2,1-2H3
charge 0 multiplicity 1
41 atoms
N  0.506488 -0.134153 -0.115926
N  3.361575 0.436344 0.105223
C  -0.998023 -0.180016 0.083685
C  -1.458166 0.757194 1.25499
C  -1.712622 0.289149 -1.222482
C  -1.407165 -1.657848 0.40551
C  -2.997119 0.864536 1.402414
C  -3.253832 0.35234 -1.089561
C  -3.669981 1.283994 0.074248
C  1.310867 -0.585537 1.050233
C  1.089287 1.129733 -0.633792
C  2.776976 -0.812359 0.641213
C  2.55948 0.916298 -1.04254
C  -0.901935 -2.716535 -0.597588
C  4.792577 0.300335 -0.220442
H  -1.050281 1.772814 1.070818
H  -1.019271 0.404869 2.20914
H  -1.410264 -0.36408 -2.062246
H  -1.377629 1.312694 -1.47848
H  -2.509094 -1.712232 0.46066
H  -1.05695 -1.917098 1.424143
H  -3.241306 1.597172 2.197148
H  -3.413388 -0.106127 1.737231
H  -3.677732 -0.65867 -0.92995
H  -3.684055 0.72196 -2.041182
H  -4.771696 1.291754 0.187672
H  -3.36628 2.322903 -0.172794
H  0.908436 -1.536485 1.436297
H  1.297996 0.158459 1.883791
H  1.057022 1.95469 0.121117
H  0.53834 1.461042 -1.528295
H  3.361731 -1.127046 1.527059
H  2.81527 -1.641573 -0.112818
H  2.58955 0.189314 -1.895404
H  2.983007 1.876729 -1.394639
H  -1.362773 -2.586407 -1.593638
H  0.191009 -2.64171 -0.72933
H  -1.150415 -3.735667 -0.24688
H  4.996273 -0.451632 -1.025546
H  5.352053 -0.007209 0.681815
H  5.193038 1.274558 -0.55537
