program: Gaussian 09
title: 000210753
version: EM64L-G09RevD.01
frameworkgroup: C1[X(C15H24N2S)]
method: RPBEPBE
basis: SDD
operation: Freq
keyword: #p
keyword: freq=noraman
keyword: PBEPBE/SDD
title: #p freq=noraman PBEPBE/SDD
converged: NO YES NO NO
title: Mulliken charges:
elementType: S N N C C C C C C C C C C C C C C C H H H H H H H H H H H H H H H H H H H H H H H H
charge: 0.271552 -0.171971 -0.051736 0.355350 -0.527835 -0.507887 -0.396242 -0.397070 -0.395696 -0.375270 -0.355994 0.580105 -0.396684 -0.394493 -0.195794 -0.825300 -0.615162 -0.614305 0.199017 0.222519 0.211704 0.188351 0.216861 0.187978 0.184766 0.218981 0.188647 0.198025 0.213270 0.204833 0.195651 0.212640 0.180301 0.203580 0.205133 0.179537 0.244976 0.265438 0.185446 0.222272 0.221634 0.262873
chargesum: 0.00000
title: Mulliken charges with hydrogens summed into heavy atoms:
elementType: S N N C C C C C C C C C C C C C C C
charge: 0.271552 -0.171971 -0.051736 0.355350 -0.106299 -0.107833 0.008597 0.006677 -0.009024 0.042832 0.052297 0.580105 -0.012804 -0.009823 0.049182 -0.559862 0.014190 -0.351432
polarizability: 2.02317224e+02 1.67902423e+01 1.79365828e+02 6.57943878e+00 -4.20719047e+00 1.68094433e+02
1716.lowfreq: -4.3605 0.0008 0.0013 0.0017 8.6617 17.5227 29.3862 42.9298 65.7371
frequency: 29.0197 42.8802 65.7289 80.5287 125.8418 140.5352 146.1560 207.0079 219.2060 234.1546 250.3897 271.6212 283.6491 292.6296 314.9847 342.4262 355.7162 369.9025 407.9920 422.5899 437.7690 479.7097 489.5640 498.3661 503.1161 573.8024 601.4462 645.3952 671.5064 686.0908 722.4123 758.9448 763.6742 778.0422 781.1712 808.2272 832.1089 854.2946 863.7953 878.6214 883.9945 907.4474 923.6956 934.9063 939.1858 967.7118 1010.6297 1016.8909 1049.8626 1054.1200 1061.5881 1075.4148 1079.0379 1092.1120 1098.4459 1101.4300 1130.1382 1131.2764 1149.2780 1151.6343 1155.1125 1158.9533 1187.8897 1196.1545 1218.6696 1241.3830 1256.5065 1267.4743 1272.3498 1284.9228 1288.4793 1310.3928 1318.9683 1336.9989 1338.3096 1343.0548 1347.2891 1350.8522 1353.1083 1363.8379 1371.6414 1374.5616 1428.6420 1443.8934 1450.9645 1454.5436 1456.4632 1459.3624 1460.7024 1465.8808 1469.0455 1471.9766 1475.6360 1480.4301 1488.8315 1530.4661 2835.7474 2839.7917 2858.8304 2894.9349 2905.3006 2960.2698 2979.2972 2981.1587 2985.4853 2990.3505 3015.2818 3018.6469 3022.9783 3025.2505 3032.7991 3038.9236 3044.1594 3052.8474 3065.7157 3068.6383 3073.6867 3176.3633 3230.9152 3236.0727
redmass: 4.5683 3.3897 3.4419 3.9162 3.3449 4.0716 2.6135 3.0124 1.6029 1.5664 5.0900 2.1188 5.1883 1.8314 2.6474 2.2508 2.6129 2.2928 2.1541 2.9865 3.7693 3.0438 2.9978 1.7832 2.6256 2.7159 6.6403 2.6235 2.1138 1.3985 4.6035 3.2298 1.8281 1.5311 2.1234 4.1910 4.0446 1.5380 2.0781 1.4185 2.0543 2.0178 2.0098 2.6482 1.6909 2.6622 2.5088 2.5060 1.6005 1.7532 1.7258 1.5042 1.7763 1.6811 1.5319 1.1747 1.8448 2.8599 2.6863 2.3405 1.9658 1.7862 1.5218 1.1153 1.6185 2.3283 1.3178 1.3217 1.2696 1.4881 1.6290 1.3216 1.3838 1.3047 1.3997 1.4777 1.4393 1.6230 1.5274 1.8803 1.4454 1.3661 1.1756 7.3454 1.0920 1.0786 1.0825 1.0820 1.0667 1.0903 1.0885 1.0862 1.1036 1.0544 1.0864 5.9562 1.0705 1.0644 1.0619 1.0697 1.0692 1.0627 1.0601 1.0612 1.0630 1.0648 1.0723 1.0877 1.0900 1.0964 1.0978 1.0988 1.1013 1.1017 1.0874 1.0891 1.1009 1.0911 1.0944 1.1003
irintensity: 0.0128 0.1015 0.2839 0.2485 1.1522 0.1363 0.1227 1.8774 0.2099 0.0701 2.1900 0.6020 0.4839 1.7091 0.6186 19.4278 0.1533 0.2515 0.9747 0.0336 0.4514 2.9264 2.2452 1.9719 0.5476 3.1443 4.5639 15.6258 33.3089 0.4818 9.7690 13.9609 46.2327 3.5621 28.6966 35.6306 1.7560 0.1348 1.8945 0.2171 3.4601 2.2704 1.2072 5.8241 6.8132 52.7620 32.4219 2.1840 2.3159 1.2940 0.2830 4.0918 2.3425 18.2470 1.1255 9.6689 2.3426 12.5866 38.0769 17.5186 17.0305 13.5354 1.9862 0.1996 8.6597 10.0768 9.2778 2.6504 0.2651 13.4255 26.1870 0.9377 3.6254 0.0405 1.1109 4.3467 2.1788 0.5334 2.4586 1.2900 1.3466 4.6849 1.0100 12.6976 6.3464 0.2234 2.6786 3.9575 30.9254 2.3410 25.6757 16.5645 2.4109 9.5322 22.4726 1.8303 58.8125 47.3766 206.9629 46.6620 94.4902 38.9749 15.5501 51.7208 57.2709 18.1060 45.7769 54.8480 68.0856 56.1649 46.7439 10.0848 1.8946 121.0703 55.8613 12.0244 35.3706 3.7867 0.6829 0.8958
temp: 298.150 k
press: 1.00000 atm
elementType: 16 7 7 6 6 6 6 6 6 6 6 6 6 6 6 6 6 6 1 1 1 1 1 1 1 1 1 1 1 1 1 1 1 1 1 1 1 1 1 1 1 1
symmnumber: 1
zpe: 958190.9 jmol-1
zpe.correction: 0.364956 hartree
zpe.thermalcorrener: 0.382256 hartree
zpe.thermalcorrenthalpy: 0.383200 hartree
zpe.thermalcorrgfe: 0.320063 hartree
zpe.sumelectzpe: -1092.106550 hartree
zpe.sumelectthermal: -1092.089249 hartree
zpe.sumelectthermalent: -1092.088305 hartree
zpe.sumelectthermalfe: -1092.151442 hartree
dipole: 1.1437 0.7697 0.3943
dipole: 1.4338
quadrupole: -118.7278 -120.8119 -110.5423
quadrupole: -1.5950 -0.8608 -1.9841
quadrupole: -2.0338 -4.1179 6.1517 -1.5950 -0.8608 -1.9841
hfenergy: -1092.4715053 hartree
pointgroup: C01 [X(C15H24N2S1)]
dipole: 0.2516107 0.4655577 0.1953691 debye
polarizability: 182.9228265|18.4298507|197.9872869|9.566388|1.9539004|168.8673719 unknown
InChI: InChI=1S/C15H24N2S/c1-16-8-10-17(11-9-16)15(6-3-2-4-7-15)14-5-12-18-13-14/h5,12-13H,2-4,6-11H2,1H3
charge 0 multiplicity 1
42 atoms
S  -2.591476 -3.382357 -0.89143
N  0.531261 0.359711 -0.013722
N  3.351705 -0.358799 0.033982
C  -0.984038 0.369341 -0.035474
C  -1.538742 1.110713 1.224828
C  -1.467636 1.196002 -1.270669
C  -1.069575 2.580639 1.315505
C  -0.991809 2.665007 -1.226515
C  -1.483422 3.375765 0.055564
C  1.195294 -0.100045 1.232577
C  1.182763 -0.301072 -1.174983
C  -1.554887 -1.066307 -0.07379
C  2.689998 0.268232 1.199162
C  2.6802 0.054295 -1.218533
C  -1.541458 -1.967548 1.069627
C  -2.087807 -1.68459 -1.197583
C  4.805181 -0.117089 0.006713
C  -2.053664 -3.224818 0.812771
H  -1.287899 0.568168 2.154524
H  -2.6441 1.081589 1.149877
H  -2.575725 1.165305 -1.274688
H  -1.142362 0.727053 -2.217815
H  0.032168 2.611763 1.417047
H  -1.499092 3.049018 2.222987
H  -1.358035 3.199503 -2.125075
H  0.114298 2.685632 -1.252211
H  -2.589998 3.463003 0.025231
H  -1.080517 4.406047 0.102237
H  1.113763 -1.204853 1.367767
H  0.73757 0.392561 2.106295
H  0.716306 0.045144 -2.111936
H  1.077701 -1.410826 -1.129909
H  2.783241 1.385788 1.17415
H  3.177996 -0.09658 2.123319
H  3.156344 -0.47348 -2.066957
H  2.782804 1.15737 -1.3941
H  -1.174564 -1.683579 2.058693
H  -2.244111 -1.279126 -2.195201
H  5.074679 0.966306 -0.089365
H  5.25622 -0.657297 -0.845307
H  5.264002 -0.501207 0.935865
H  -2.159576 -4.07478 1.484241
