program: Gaussian 09
title: 000210747
version: EM64L-G09RevD.01
frameworkgroup: C1[X(C15H24N2O)]
method: RPBEPBE
basis: SDD
operation: Freq
keyword: #p
keyword: freq=noraman
keyword: PBEPBE/SDD
title: #p freq=noraman PBEPBE/SDD
converged: NO YES NO NO
title: Mulliken charges:
elementType: O N N C C C C C C C C C C C C C C C H H H H H H H H H H H H H H H H H H H H H H H H
charge: -0.259824 -0.176486 -0.052990 0.369985 -0.527162 -0.517267 -0.394770 -0.389406 -0.397748 -0.365676 -0.356945 0.331984 -0.396431 -0.395856 -0.414378 -0.614839 -0.286155 -0.186674 0.229531 0.213488 0.212985 0.195488 0.218426 0.187760 0.185313 0.220208 0.188260 0.197577 0.218077 0.206252 0.196279 0.211146 0.179181 0.204619 0.204296 0.178930 0.250728 0.185035 0.221517 0.222015 0.248861 0.254667
chargesum: 0.00000
title: Mulliken charges with hydrogens summed into heavy atoms:
elementType: O N N C C C C C C C C C C C C C C C
charge: -0.259824 -0.176486 -0.052990 0.369985 -0.084143 -0.108794 0.011416 0.016115 -0.011911 0.058653 0.050481 0.331984 -0.012631 -0.012631 -0.163650 0.013729 -0.037294 0.067993
polarizability: 1.78148089e+02 -1.17484899e+01 1.77672091e+02 4.38931237e+00 1.03830047e+00 1.57311161e+02
1716.lowfreq: -15.6698 -13.1513 -0.0008 -0.0007 -0.0007 9.4507 18.4448 44.0836 56.0690
frequency: 17.7554 44.0242 56.0157 82.1306 121.3910 128.7726 145.1277 203.7018 211.4615 229.9994 265.2643 267.2657 284.7990 296.5946 323.2060 340.3003 356.6329 373.1757 402.1396 429.6589 476.3332 483.2067 503.9287 505.8634 573.2100 592.8949 651.7116 688.6747 717.5028 756.5879 765.8939 782.5164 809.1070 823.3290 847.7544 860.8938 869.7551 869.9142 879.9372 900.0027 908.4259 926.0903 938.6242 963.1402 990.1905 1009.7919 1013.7280 1046.4157 1047.3920 1054.8931 1062.4456 1076.4068 1077.5617 1089.2942 1098.6382 1128.3836 1129.9931 1133.9768 1147.5159 1148.6865 1154.7778 1170.0972 1195.4368 1199.1247 1215.9203 1241.6820 1256.4656 1268.9835 1272.3970 1285.5908 1287.9383 1309.4853 1317.9504 1337.5200 1340.2185 1345.3613 1347.0771 1350.3978 1356.1302 1357.3734 1372.3862 1374.7498 1426.7646 1449.2841 1452.0125 1454.8721 1456.9235 1460.2002 1463.6566 1467.2069 1472.3409 1475.5441 1479.8222 1482.0766 1491.7347 1560.7422 2833.6245 2837.5436 2856.5965 2899.9834 2919.0364 2960.3918 2982.6596 2984.3493 2988.7544 2993.8943 3015.0534 3018.5824 3023.0589 3025.3755 3036.1787 3044.0177 3052.8100 3060.6158 3061.9491 3073.6819 3075.0634 3215.2542 3230.9365 3264.5222
redmass: 3.3986 3.7955 3.4953 3.8559 3.3090 3.8102 2.6336 2.7602 1.4941 1.6290 3.2348 2.4262 1.9172 4.7086 2.6963 2.2398 2.6727 2.1415 2.2370 3.1617 3.1891 2.8351 1.8767 2.3939 2.7689 3.0391 2.8300 3.4185 1.3224 3.6315 2.3773 1.4864 1.3433 3.3999 1.5482 2.5830 3.5487 1.6617 1.9321 2.5958 2.3191 1.9922 1.6429 2.7360 2.0722 2.4963 2.4442 2.1121 1.6220 1.8200 1.9144 1.4051 1.8735 1.8593 1.6699 1.7414 1.6950 2.5808 2.6788 2.6808 1.8360 2.7372 1.4590 1.4739 1.5572 2.3545 1.3122 1.3399 1.3094 1.4569 1.6179 1.3108 1.3754 1.3293 1.3648 1.4352 1.4408 1.7427 1.4403 1.7572 1.4305 1.3692 1.1734 1.0861 1.0783 1.0799 1.0761 1.0801 1.0842 1.0938 1.1052 1.0977 1.0550 5.4398 1.0870 6.0890 1.0708 1.0643 1.0620 1.0697 1.0693 1.0626 1.0602 1.0617 1.0643 1.0660 1.0722 1.0877 1.0897 1.0963 1.0990 1.1012 1.1001 1.0980 1.0885 1.1009 1.0891 1.0912 1.0985 1.1082
irintensity: 0.4432 0.4991 0.1837 0.2594 1.1163 0.5133 0.0776 2.4391 0.5281 0.3519 1.1419 4.3080 1.2172 1.3891 1.9793 17.3623 0.6302 0.4451 1.2866 0.7697 7.0190 1.1398 2.2454 0.3755 1.1299 5.7198 0.2125 3.8294 83.3899 4.4876 20.5509 0.9992 23.8510 11.5699 0.0596 6.8205 0.7638 0.5549 2.7006 9.9059 2.0920 1.1080 5.7490 54.5792 21.8998 24.9673 17.9824 1.1708 1.9355 6.0415 1.5381 2.6250 2.2997 19.0381 1.2157 1.7796 21.6531 18.9370 0.8090 50.0937 8.5858 4.8402 3.4550 1.3708 9.8879 3.0240 9.1056 3.6845 0.7696 12.2890 27.4620 1.3570 1.7973 0.3377 0.4974 3.0645 1.3541 4.1676 2.5911 0.4690 0.7088 4.6206 0.8263 6.6252 0.2904 2.5916 22.4670 13.4830 12.8369 19.1455 9.1102 7.2383 9.7308 17.3617 23.3344 5.9208 57.4833 47.2823 215.5108 55.4867 68.1375 40.6577 21.1109 48.0487 44.6697 23.7757 43.6481 55.8727 67.6115 55.3095 30.4404 13.4348 56.8184 62.5308 46.5130 29.9117 35.0786 6.8872 0.8328 1.0720
temp: 298.150 k
press: 1.00000 atm
elementType: 8 7 7 6 6 6 6 6 6 6 6 6 6 6 6 6 6 6 1 1 1 1 1 1 1 1 1 1 1 1 1 1 1 1 1 1 1 1 1 1 1 1
symmnumber: 1
zpe: 964992.8 jmol-1
zpe.correction: 0.367546 hartree
zpe.thermalcorrener: 0.384566 hartree
zpe.thermalcorrenthalpy: 0.385510 hartree
zpe.thermalcorrgfe: 0.322488 hartree
zpe.sumelectzpe: -769.260313 hartree
zpe.sumelectthermal: -769.243294 hartree
zpe.sumelectthermalent: -769.242350 hartree
zpe.sumelectthermalfe: -769.305371 hartree
dipole: -0.0602 0.2603 0.6509
dipole: 0.7036
quadrupole: -106.3938 -109.0771 -104.9731
quadrupole: -3.1220 1.7244 0.1596
quadrupole: 0.4209 -2.2625 1.8416 -3.1220 1.7244 0.1596
hfenergy: -769.6278593 hartree
pointgroup: C01 [X(C15H24N2O1)]
dipole: -0.004941 -0.1088522 -0.2544671 debye
polarizability: 172.8771367|10.6228038|182.7679841|-4.9433313|-0.5226322|157.4862202 unknown
InChI: InChI=1S/C15H24N2O/c1-16-9-11-17(12-10-16)15(7-3-2-4-8-15)14-6-5-13-18-14/h5-6,13H,2-4,7-12H2,1H3
charge 0 multiplicity 1
42 atoms
O  1.364363 1.966311 1.021902
N  -0.512633 -0.40769 -0.014537
N  -3.374118 0.132814 0.035661
C  0.997033 -0.272398 -0.051842
C  1.628103 -0.921266 1.22336
C  1.562643 -1.06341 -1.276424
C  1.285178 -2.423083 1.342874
C  1.210783 -2.565986 -1.204872
C  1.757175 -3.205612 0.093856
C  -1.186169 0.095616 1.213265
C  -1.225068 0.114644 -1.210687
C  1.430915 1.181811 -0.161324
C  -2.65577 -0.359898 1.232439
C  -2.696427 -0.335639 -1.193511
C  1.835797 2.000187 -1.207326
C  -4.80822 -0.20803 0.055514
C  2.034642 3.334576 -0.677555
C  1.740529 3.276861 0.671882
H  1.334911 -0.36924 2.132829
H  2.726358 -0.799873 1.137145
H  2.663573 -0.939094 -1.267716
H  1.210799 -0.632293 -2.231624
H  0.190702 -2.542634 1.454169
H  1.758704 -2.838119 2.254258
H  1.625343 -3.08598 -2.090759
H  0.110752 -2.680445 -1.232389
H  2.867093 -3.20469 0.06129
H  1.438476 -4.263884 0.161883
H  -1.151423 1.207166 1.281149
H  -0.684286 -0.313661 2.104886
H  -0.754467 -0.282252 -2.125844
H  -1.189239 1.228972 -1.260858
H  -2.684808 -1.479603 1.295076
H  -3.150663 0.046308 2.135221
H  -3.218633 0.090711 -2.071418
H  -2.730439 -1.453734 -1.279291
H  1.985551 1.689289 -2.239304
H  -5.002795 -1.311583 0.045717
H  -5.308653 0.234013 -0.825069
H  -5.278218 0.212575 0.962888
H  2.355827 4.216308 -1.228965
H  1.740982 3.999931 1.482651
