program: Gaussian 09
title: 000216200
version: EM64L-G09RevD.01
frameworkgroup: C1[X(C18H20N2O7)]
method: RPBEPBE
basis: SDD
operation: Freq
keyword: #p
keyword: freq=noraman
keyword: PBEPBE/SDD
title: #p freq=noraman PBEPBE/SDD
converged: YES YES NO NO
title: Mulliken charges:
elementType: O O O O O O O N N C C C C C C C C C C C C C C C C C C H H H H H H H H H H H H H H H H H H H H
charge: -0.296331 -0.428834 -0.224196 -0.530636 -0.489215 -0.437267 -0.520195 -0.381378 -0.568157 -0.139222 -0.247938 -0.589907 -0.604025 0.257636 0.547536 0.567569 0.159192 -0.519794 -0.399711 -0.542788 -0.409725 0.152407 -0.342561 0.173561 -0.324009 0.123612 0.176368 0.297428 0.229580 0.230060 0.246360 0.213670 0.231832 0.344583 0.294305 0.272917 0.239321 0.247465 0.259278 0.238866 0.247489 0.257648 0.391773 0.423398 0.382870 0.384434 0.404727
chargesum: 0.00000
title: Mulliken charges with hydrogens summed into heavy atoms:
elementType: O O O O O O O N N C C C C C C C C C C C C C C C C C C
charge: -0.296331 -0.037061 -0.224196 -0.107238 -0.106345 -0.052832 -0.115468 -0.036795 -0.000935 0.158206 -0.018357 -0.113487 -0.158522 0.257636 0.547536 0.567569 0.159192 -0.280473 -0.152246 -0.283509 -0.170859 0.152407 -0.095071 0.173561 -0.066360 0.123612 0.176368
polarizability: 2.58263035e+02 -1.94806072e+01 2.30728386e+02 -1.12577688e+01 8.14105640e+00 1.94979023e+02
1716.lowfreq: -3.7712 -2.1418 -0.0009 -0.0006 -0.0004 5.3460 15.8546 29.4908 37.8087
frequency: 15.6331 29.3508 37.7809 49.3007 56.2506 61.8674 68.5408 75.2399 81.1928 113.3832 121.9658 147.3185 162.4862 169.8440 208.1438 220.6682 248.1564 259.4708 268.5710 276.9803 280.5551 302.0458 314.7451 316.4189 326.9438 336.0080 343.4929 372.1930 398.7457 428.7106 434.2564 439.0854 448.7108 461.0486 502.6051 524.9215 532.9436 539.5497 543.7780 553.5126 569.4319 578.9373 588.1687 593.5647 608.4864 620.2641 643.5681 651.9334 703.1117 707.2739 710.3779 725.8590 740.9973 746.8940 759.2058 766.4028 803.1450 816.2347 826.9168 845.5701 855.9478 863.5115 882.9289 904.3030 923.5744 933.4174 942.6905 943.9754 963.4806 990.6145 1007.4764 1071.4171 1072.5405 1088.1404 1103.0930 1108.5290 1122.6047 1139.6681 1144.0824 1162.1677 1173.1034 1184.7070 1192.6571 1195.8681 1201.1955 1211.5224 1229.9079 1247.0743 1259.3653 1279.5853 1284.2526 1287.2454 1289.5787 1317.3101 1320.7641 1340.6326 1345.3109 1372.7322 1382.4300 1409.4597 1416.1008 1431.1665 1433.6768 1458.8715 1461.7961 1492.3961 1517.0348 1526.4541 1591.0211 1611.0880 1620.0090 1623.0948 1625.7646 1636.3762 1665.1622 2992.8892 2997.8894 3002.6006 3017.6228 3063.4296 3066.9946 3126.7542 3134.2090 3134.9452 3153.2898 3168.0908 3171.6554 3178.6375 3461.0282 3481.3172 3522.8862 3527.0349 3554.1878 3595.0420 3622.8737
redmass: 6.2807 8.0722 5.5092 6.9039 6.9850 6.2627 5.6823 9.7714 5.7974 5.5512 6.2333 6.0084 5.9421 6.6333 5.9341 5.6957 2.7961 4.3112 3.2639 3.0016 2.6131 2.5278 2.4711 1.3203 3.5977 3.7628 3.7620 5.2762 4.2831 5.0796 3.1133 3.2856 3.5539 3.2108 3.7235 2.5189 1.9697 1.4333 1.5161 2.6942 5.1812 4.9464 1.7981 2.1811 1.6526 4.1412 2.1180 2.4919 5.2419 3.9013 4.1919 6.3109 3.4934 4.8195 4.0724 5.3261 2.8128 1.4259 1.4859 1.6297 1.6793 1.2390 2.6929 4.0961 2.5057 3.0631 1.3393 1.3810 2.1640 2.8597 4.8143 2.3937 2.0511 2.8734 2.2890 2.3038 1.5309 1.3458 1.8085 1.4714 1.3762 1.3555 1.2208 1.4070 1.4627 2.1366 1.6708 1.3561 1.9507 1.4036 2.0145 1.4825 1.9282 2.0855 1.2823 1.7177 1.2866 1.6076 1.7174 4.6701 3.7518 3.2079 3.5020 1.1165 1.1570 2.1124 3.0606 2.9670 2.8287 6.1730 6.8488 7.0684 6.6813 1.3874 9.0178 1.0612 1.0852 1.0621 1.0805 1.1023 1.1029 1.0921 1.0891 1.0897 1.0902 1.0949 1.0957 1.0729 1.0443 1.0641 1.0647 1.0643 1.0779 1.0988 1.0668
irintensity: 0.3428 11.8963 0.8761 3.3366 0.9241 1.0818 0.4877 1.7236 0.9475 2.7334 2.4842 6.7790 0.6172 1.8077 1.1046 0.6550 33.4178 7.0082 13.9018 2.5611 23.9292 30.5338 8.6752 134.5731 33.5324 0.7438 8.4272 2.3734 13.6823 6.2130 12.6877 16.0456 6.2040 9.2599 25.9410 78.1565 82.6335 35.1242 90.4669 59.1562 10.2413 30.1911 130.0392 36.6570 159.6430 12.1131 193.0538 59.4414 4.9226 10.0988 4.2925 8.1088 2.7266 29.2687 8.9580 19.2289 6.5710 64.5412 13.6892 11.3448 14.4432 81.6342 38.1523 2.5782 0.7660 37.4394 0.6089 9.5968 3.4978 53.7042 44.9588 191.8513 38.5417 83.1535 18.6329 45.4577 10.5513 8.0185 6.2052 12.0180 14.6417 153.2132 25.7703 251.3446 19.3058 80.5080 21.5826 14.7604 163.7766 33.2206 75.3485 26.0924 16.5216 34.0982 1.2500 37.9790 47.6677 57.2401 8.9018 13.7425 25.0812 45.5226 61.1876 12.8247 11.3724 232.0182 89.2964 64.6645 187.8077 22.8311 34.6782 6.0351 17.1136 20.1390 210.0080 38.2557 28.5685 19.3207 11.8340 12.4501 10.6049 5.0893 5.6373 11.4469 1.2064 50.8457 2.4317 992.0672 7.8108 72.1853 96.0227 33.7606 41.1558 6.0536 62.0604
temp: 298.150 k
press: 1.00000 atm
elementType: 8 8 8 8 8 8 8 7 7 6 6 6 6 6 6 6 6 6 6 6 6 6 6 6 6 6 6 1 1 1 1 1 1 1 1 1 1 1 1 1 1 1 1 1 1 1 1
symmnumber: 1
zpe: 950499.0 jmol-1
zpe.correction: 0.362026 hartree
zpe.thermalcorrener: 0.387991 hartree
zpe.thermalcorrenthalpy: 0.388935 hartree
zpe.thermalcorrgfe: 0.305223 hartree
zpe.sumelectzpe: -1332.017417 hartree
zpe.sumelectthermal: -1331.991452 hartree
zpe.sumelectthermalent: -1331.990508 hartree
zpe.sumelectthermalfe: -1332.074219 hartree
dipole: -4.6779 -2.6217 -0.6178
dipole: 5.3980
quadrupole: -166.8729 -160.5618 -144.6839
quadrupole: 5.1584 7.0818 -15.2062
quadrupole: -9.5000 -3.1890 12.6890 5.1584 7.0818 -15.2062
hfenergy: -1332.3794428 hartree
pointgroup: C01 [X(C18H20N2O7)]
dipole: 1.9053099 -0.8763402 -0.3347373 debye
polarizability: 221.6457747|-7.311557|268.2666051|-1.0999351|-10.8519278|194.0580651 unknown
InChI: InChI=1S/C18H20N2O7/c19-11(5-9-1-3-13(21)15(23)7-9)17(25)20-12(18(26)27)6-10-2-4-14(22)16(24)8-10/h1-4,7-8,11-12,20-24,26H,5-6,19H2
charge 0 multiplicity 1
47 atoms
O  0.628974 -3.232943 1.080732
O  -3.179258 -1.749537 -1.224329
O  -4.232572 -1.94171 0.837029
O  0.149943 3.751121 -0.562914
O  2.949304 1.272281 2.307973
O  -2.315146 4.56834 -1.154891
O  2.625348 3.033266 0.314275
N  -0.739197 -1.903958 -0.255371
N  1.07793 -4.397154 -1.60113
C  -1.778352 -1.748597 0.767714
C  1.2573 -2.97344 -1.275338
C  -1.66369 -0.435649 1.630602
C  2.744408 -2.567587 -0.962264
C  0.362605 -2.701412 -0.046977
C  -1.845497 0.876928 0.881196
C  2.876057 -1.092024 -0.638201
C  -3.180301 -1.841356 0.172502
C  -0.712105 1.652086 0.514378
C  -3.139356 1.367903 0.565691
C  2.948483 -0.662682 0.712792
C  2.813213 -0.116617 -1.667478
C  -0.873088 2.88071 -0.156799
C  -3.30593 2.59298 -0.121213
C  2.919109 0.710448 1.012213
C  2.772456 1.263125 -1.36647
C  -2.177287 3.347442 -0.487095
C  2.802672 1.667012 -0.023397
H  -1.658625 -2.593355 1.473851
H  0.90704 -2.370301 -2.135863
H  -0.668992 -0.474861 2.109758
H  -2.422556 -0.529844 2.429999
H  3.3505 -2.835639 -1.849337
H  3.081508 -3.193349 -0.115917
H  -0.938664 -1.539633 -1.18907
H  1.211138 -5.016211 -0.794878
H  1.565437 -4.714056 -2.443441
H  0.290262 1.286515 0.758166
H  -4.02645 0.804039 0.876363
H  2.980046 -1.409359 1.516168
H  2.781254 -0.437165 -2.715042
H  -4.29986 2.981832 -0.361912
H  2.694718 2.020379 -2.152039
H  -4.11526 -1.756165 -1.56115
H  1.072335 3.508897 -0.231387
H  2.998695 0.58496 3.014226
H  -1.398674 4.934079 -1.292971
H  2.80323 3.150761 1.285148
