program: Gaussian 09
title: 000210740
version: EM64L-G09RevD.01
frameworkgroup: C1[X(C12H18N6O2)]
method: RPBEPBE
basis: SDD
operation: Freq
keyword: #p
keyword: freq=noraman
keyword: PBEPBE/SDD
title: #p freq=noraman PBEPBE/SDD
converged: YES YES NO NO
title: Mulliken charges:
elementType: O O N N N N N N C C C C C C C C C C C C H H H H H H H H H H H H H H H H H H
charge: -0.266297 -0.290912 -0.158103 -0.147436 -0.426728 -0.425105 0.030787 0.037790 0.164736 -0.038482 -0.248165 -0.582027 0.166496 0.226420 0.170743 0.191312 -0.768078 -0.769223 -0.765132 -0.791474 0.269616 0.204730 0.272045 0.273170 0.386829 0.373473 0.224340 0.224344 0.258787 0.229708 0.256944 0.255745 0.227788 0.227902 0.262491 0.248938 0.245951 0.246076
chargesum: 0.00000
title: Mulliken charges with hydrogens summed into heavy atoms:
elementType: O O N N N N N N C C C C C C C C C C C C
charge: -0.266297 -0.290912 -0.158103 -0.147436 -0.039900 -0.051632 0.030787 0.037790 0.164736 -0.038482 0.021451 0.167919 0.166496 0.226420 0.170743 0.191312 -0.060608 -0.026826 -0.046950 -0.050510
polarizability: 2.90635371e+02 -1.37291794e+00 2.53263023e+02 6.37696985e-02 1.73784055e-01 9.63700838e+01
1716.lowfreq: -3.5449 -0.0004 -0.0003 0.0005 3.4995 3.8444 31.5229 41.3443 50.5656
frequency: 31.3762 41.3388 50.5446 52.4357 55.6744 84.3354 101.5744 120.3169 129.3288 151.5270 154.5063 164.2537 182.6299 194.4514 196.1393 220.2520 237.7909 244.2266 265.4463 269.3649 325.0886 335.2815 342.8787 358.1951 380.7599 390.9488 414.0783 459.6882 505.6048 512.7518 525.5310 573.6294 604.9102 609.0529 640.3325 705.8824 716.8708 762.4275 771.5013 782.1037 784.7470 813.6871 863.2413 893.4174 945.4580 952.7927 953.5525 960.9595 966.5238 981.5860 992.8679 1014.3319 1056.5199 1078.6764 1079.9681 1081.8751 1111.3976 1123.3258 1135.7619 1169.6576 1198.1654 1259.7227 1280.2740 1285.2324 1295.4663 1343.9240 1353.5378 1383.2618 1383.5741 1396.0605 1397.5520 1429.1294 1443.7479 1445.4145 1448.3726 1460.0779 1462.0839 1462.2168 1465.3295 1472.8481 1474.9300 1477.8966 1478.1893 1490.3995 1529.7808 1570.5461 1581.3123 1600.9766 1607.4200 1643.4193 2931.8392 2966.6074 2967.3260 2971.4849 2982.6830 3016.5912 3039.8991 3040.9715 3043.9744 3057.4572 3103.9734 3105.8063 3115.7821 3118.0462 3122.2481 3135.6647 3237.5875 3345.0478
redmass: 4.1268 3.7129 3.6777 3.4389 4.0727 4.3463 4.2730 3.4851 3.0292 1.3128 1.0598 1.0756 4.4017 1.1686 1.0941 3.8684 4.4977 4.8530 4.1783 4.3167 4.7895 5.8485 3.6187 3.7982 4.7963 3.2520 3.2098 4.3035 3.2595 3.4297 4.6746 4.5205 6.5706 5.0598 4.6641 6.4467 8.5321 5.8303 7.0058 1.2229 4.7450 1.4871 4.3456 4.2402 1.1708 1.1736 1.2621 1.3973 1.4196 4.6649 5.9756 3.1904 1.7623 1.6639 1.6554 2.2945 2.6365 1.3304 3.7966 2.5304 2.8280 2.7935 4.7409 3.6717 3.5338 4.6184 8.2893 1.2417 1.2462 1.2388 1.2195 1.6845 1.2791 1.0414 1.1259 1.1985 1.0482 1.0488 1.0896 1.2172 1.0430 2.1410 1.0450 1.8430 2.4098 2.9033 8.0394 6.4682 6.1901 1.8312 1.0949 1.0391 1.0381 1.0386 1.0384 1.0348 1.0968 1.0973 1.0969 1.0961 1.0993 1.0967 1.0977 1.0976 1.1011 1.1021 1.0991 1.0759
irintensity: 0.8568 8.8660 0.0906 2.8529 1.7117 0.7214 3.4950 0.8682 0.5848 1.1235 0.4587 0.6170 4.7503 2.2145 0.4945 8.3034 2.1371 4.8419 8.9528 0.8211 5.2141 15.6946 0.7926 6.6572 0.1606 0.3095 0.7740 4.9408 0.6494 0.6387 1.9949 13.7075 7.8065 3.3775 10.7683 2.1624 0.7319 17.4291 0.4897 82.5520 16.6511 13.8593 48.6926 40.9543 59.8070 28.1855 0.2131 6.1130 1.6163 25.7200 14.1645 23.2559 0.4246 6.8865 5.8710 1.0182 31.5553 0.8474 62.6773 19.9297 111.3904 2.4108 27.1117 20.6544 45.9957 21.0201 49.2555 26.2130 67.1498 2.6718 4.2790 11.1334 192.5921 15.1419 59.5652 49.5440 15.7963 23.6423 32.9449 62.7589 12.7655 97.9818 13.1901 1.7999 487.8947 446.6103 172.8342 43.6647 8.4311 20.5333 726.1833 8.2555 29.3290 29.4952 17.4812 40.5125 22.2963 9.1002 25.7831 10.2603 30.4148 17.8712 15.3950 12.4250 17.3763 5.6853 1.5783 37.3395
temp: 298.150 k
press: 1.00000 atm
elementType: 8 8 7 7 7 7 7 7 6 6 6 6 6 6 6 6 6 6 6 6 1 1 1 1 1 1 1 1 1 1 1 1 1 1 1 1 1 1
symmnumber: 1
zpe: 789829.8 jmol-1
zpe.correction: 0.300830 hartree
zpe.thermalcorrener: 0.322268 hartree
zpe.thermalcorrenthalpy: 0.323213 hartree
zpe.thermalcorrgfe: 0.249579 hartree
zpe.sumelectzpe: -945.507071 hartree
zpe.sumelectthermal: -945.485633 hartree
zpe.sumelectthermalent: -945.484689 hartree
zpe.sumelectthermalfe: -945.558323 hartree
dipole: -5.5404 2.4053 -0.0352
dipole: 6.0401
quadrupole: -111.5469 -94.4663 -119.0863
quadrupole: -6.3967 -0.2829 -0.0896
quadrupole: -3.1804 13.9002 -10.7198 -6.3967 -0.2829 -0.0896
hfenergy: -945.8079017 hartree
pointgroup: C01 [X(C12H18N6O2)]
dipole: 1.8788847 1.4463757 0.1574124 debye
polarizability: 287.3009648|9.726381|255.9084818|9.5533853|6.2816643|97.0590306 unknown
InChI: InChI=1S/C12H18N6O2/c1-7(2)14-16-11(19)9-10(18(5)6-13-9)12(20)17-15-8(3)4/h6,16-17H,1-5H3
charge 0 multiplicity 1
38 atoms
O  -3.604594 0.545697 0.195813
O  0.68243 -1.343265 0.35568
N  -1.542521 2.502686 0.390294
N  0.711026 2.323701 0.491093
N  -2.008025 -1.19269 0.227257
N  2.390877 0.270816 0.487966
N  -3.006211 -2.171536 0.130486
N  3.423469 -0.666166 0.505428
C  -1.269623 1.119837 0.348117
C  0.14747 1.03757 0.413551
C  -0.329681 3.170398 0.474851
C  -2.85165 3.189317 0.356203
C  -2.402465 0.135815 0.250528
C  1.068253 -0.1279 0.414371
C  -2.610076 -3.430781 0.112993
C  4.653169 -0.192683 0.574564
C  -3.706927 -4.46571 0.004549
C  -1.169941 -3.909802 0.19029
C  5.764881 -1.214225 0.593787
C  5.018233 1.284454 0.634932
H  -0.263744 4.254602 0.521034
H  -2.662727 4.273862 0.430385
H  -3.385323 2.957422 -0.576679
H  -3.484818 2.853487 1.189694
H  -0.975784 -1.415549 0.276119
H  2.533544 1.294894 0.531418
H  -3.686011 -5.152549 0.873402
H  -3.569525 -5.089243 -0.900741
H  -4.690873 -3.973934 -0.042724
H  -1.124481 -5.010108 0.16613
H  -0.561568 -3.518375 -0.64746
H  -0.66949 -3.560849 1.113678
H  6.373234 -1.11721 1.514178
H  6.451096 -1.066023 -0.262814
H  5.346599 -2.231481 0.546096
H  6.110629 1.413634 0.682177
H  4.652169 1.832661 -0.256049
H  4.58208 1.777124 1.526902
