program: Gaussian 09
title: 000216195
version: EM64L-G09RevD.01
frameworkgroup: C1[X(C18H20N2O7)]
method: RPBEPBE
basis: SDD
operation: Freq
keyword: #p
keyword: freq=noraman
keyword: PBEPBE/SDD
title: #p freq=noraman PBEPBE/SDD
converged: YES YES NO NO
title: Mulliken charges:
elementType: O O O O O O O N N C C C C C C C C C C C C C C C C C C H H H H H H H H H H H H H H H H H H H H
charge: -0.299419 -0.397131 -0.230376 -0.492189 -0.435186 -0.432049 -0.489177 -0.358702 -0.638052 -0.156510 -0.237312 -0.569209 -0.588504 0.266666 0.581680 0.526506 0.143279 -0.556716 -0.403796 -0.493495 -0.481694 0.171006 -0.367362 0.186459 -0.330303 0.140130 0.125995 0.285058 0.269102 0.267067 0.208839 0.248842 0.207017 0.349479 0.289770 0.288074 0.225167 0.269659 0.319410 0.227125 0.256701 0.216840 0.384464 0.371120 0.380357 0.381609 0.369758
chargesum: 0.00000
title: Mulliken charges with hydrogens summed into heavy atoms:
elementType: O O O O O O O N N C C C C C C C C C C C C C C C C C C
charge: -0.299419 -0.012667 -0.230376 -0.121069 -0.054829 -0.050439 -0.119419 -0.009223 -0.060208 0.128548 0.031791 -0.093303 -0.132646 0.266666 0.581680 0.526506 0.143279 -0.331549 -0.134137 -0.174084 -0.254569 0.171006 -0.110661 0.186459 -0.113462 0.140130 0.125995
polarizability: 3.00526801e+02 8.06111276e+00 2.27103375e+02 -2.35881836e+01 -1.23451002e+01 1.80029161e+02
1716.lowfreq: -8.3844 -4.8887 -0.0008 -0.0006 -0.0004 0.8836 10.3210 13.6196 20.5734
frequency: 10.2430 13.3074 20.5209 24.0044 30.0989 36.0826 54.6469 60.4614 85.1893 90.2131 115.4152 133.6079 164.7220 181.6805 203.5762 216.8005 225.4273 244.3495 258.0390 261.0029 276.5324 278.8152 283.0786 287.2841 329.9386 335.1388 337.7758 360.7889 376.5915 400.1961 429.1148 434.5986 436.9304 446.0614 475.3597 487.1240 488.1958 519.7438 530.6632 540.2803 551.8224 567.6978 572.4724 579.7448 590.7842 628.2868 629.3882 682.1790 698.8371 707.8755 720.8230 735.0263 739.4229 745.8005 767.2291 769.1041 784.6442 803.4584 813.0362 833.7589 850.0391 887.2128 891.1373 903.4282 920.6776 932.8785 940.9125 949.2110 954.2654 1026.5058 1045.1158 1068.8898 1072.9707 1082.5753 1090.0954 1129.7589 1138.0572 1140.1430 1149.9371 1154.7925 1161.8745 1180.9660 1182.5818 1183.2878 1195.4942 1219.8301 1235.6715 1239.4386 1269.1894 1272.2052 1279.1296 1291.2820 1305.9123 1308.2802 1311.7693 1327.7957 1331.2998 1356.4421 1360.4910 1406.6312 1409.9813 1436.6530 1450.2723 1458.2172 1465.5631 1477.5778 1501.2605 1523.9532 1603.4681 1609.2719 1615.7061 1628.2108 1629.0903 1643.1956 1646.1838 2970.1668 2980.1091 2991.2796 3005.1141 3031.1934 3053.4801 3101.9016 3113.8926 3140.3411 3141.2566 3152.7325 3170.8910 3406.5506 3436.8219 3507.6812 3524.7252 3528.3281 3565.2142 3621.7916 3622.9556
redmass: 6.8193 5.8838 6.4969 8.0997 5.1046 5.9265 6.2236 6.0789 6.6115 6.9943 5.8873 5.5844 5.3029 4.8487 7.0125 5.0824 3.9227 4.0191 1.1138 1.1929 2.2022 5.0211 4.7350 3.7186 3.8555 3.3373 3.3941 2.5858 3.2164 3.6352 5.2388 2.9173 3.8039 3.2945 1.1131 2.6509 1.3527 5.2294 4.7639 4.7662 4.6321 5.5187 4.8007 3.5314 3.0179 2.6584 2.7650 2.5682 3.2121 3.8167 4.2007 5.1558 1.8854 4.6780 4.4672 3.7569 1.5973 1.1575 1.3870 1.4149 3.8604 2.2903 1.5574 4.0337 1.7231 2.8519 1.7519 2.8354 1.3715 3.6723 2.8420 2.3518 2.3495 2.1737 2.3541 1.6914 1.4283 1.3301 1.9695 1.7483 1.5427 1.4366 1.3920 1.4023 1.2797 1.4718 2.1255 1.8690 2.3385 1.5882 1.5837 2.0485 1.4267 1.5812 1.6172 1.5343 1.5290 1.4620 1.4553 4.8674 3.2273 3.6549 1.1658 1.2608 2.6221 1.9971 3.3057 3.0737 7.8479 7.5796 6.2318 6.9713 6.5935 1.1007 9.1670 1.0745 1.0671 1.0616 1.0812 1.0988 1.1027 1.0911 1.0876 1.0906 1.0958 1.0934 1.0952 1.0772 1.0464 1.0638 1.0648 1.0649 1.0966 1.0666 1.0666
irintensity: 0.0380 1.9548 1.3555 1.1651 3.8209 0.4681 7.4711 0.7755 1.8592 0.5016 2.0702 0.6206 0.2529 1.1631 6.1470 5.8209 9.3971 29.6861 163.0071 147.6736 6.7614 10.4987 12.0250 5.8875 2.3751 0.9920 1.7593 28.8202 7.2339 1.5557 13.2142 19.9993 9.2162 20.0890 122.8565 38.0686 104.3297 18.6373 8.9260 10.0699 21.3229 13.0018 3.0128 63.1401 49.1931 37.7398 32.3505 43.3002 108.0443 3.8562 9.9243 10.5334 187.5029 27.9682 25.8192 24.3192 23.6734 139.9785 63.0022 0.4841 6.0609 21.3480 6.3074 35.0691 4.8840 34.9998 24.3967 23.9311 4.3509 16.0083 51.1189 226.9670 188.3870 113.5253 11.1295 19.1245 23.4326 3.9540 14.2559 57.1028 5.7303 65.1845 87.2633 117.6074 25.2749 17.9145 121.5459 70.1399 127.6383 26.7114 83.3342 13.1849 33.6290 6.0563 31.3086 23.0988 30.7985 7.9871 1.3212 4.2196 32.5856 32.0829 18.2863 126.5470 10.3857 273.8307 152.0020 111.5200 152.8050 52.5513 13.1849 5.8673 0.7964 29.2096 278.6624 45.0539 7.0472 15.8255 16.3397 11.2055 11.7292 15.2253 18.0863 1.7708 15.7035 23.8402 3.5520 111.0548 2.5605 30.2192 81.0209 85.4794 2.5980 53.5830 52.8252
temp: 298.150 k
press: 1.00000 atm
elementType: 8 8 8 8 8 8 8 7 7 6 6 6 6 6 6 6 6 6 6 6 6 6 6 6 6 6 6 1 1 1 1 1 1 1 1 1 1 1 1 1 1 1 1 1 1 1 1
symmnumber: 1
zpe: 946953.1 jmol-1
zpe.correction: 0.360675 hartree
zpe.thermalcorrener: 0.387450 hartree
zpe.thermalcorrenthalpy: 0.388394 hartree
zpe.thermalcorrgfe: 0.299188 hartree
zpe.sumelectzpe: -1332.004108 hartree
zpe.sumelectthermal: -1331.977334 hartree
zpe.sumelectthermalent: -1331.976390 hartree
zpe.sumelectthermalfe: -1332.065596 hartree
dipole: 0.3393 -0.4198 7.7070
dipole: 7.7258
quadrupole: -110.5284 -161.9529 -153.6869
quadrupole: -8.1920 -3.0227 -1.2765
quadrupole: 31.5277 -19.8969 -11.6308 -8.1920 -3.0227 -1.2765
hfenergy: -1332.3647836 hartree
pointgroup: C01 [X(C18H20N2O7)]
dipole: -0.2746533 -1.5985732 -2.5706342 debye
polarizability: 297.9670326|-11.1319511|223.4753973|-30.2392887|-13.6264214|186.2169076 unknown
InChI: InChI=1S/C18H20N2O7/c19-11(5-9-1-3-13(21)15(23)7-9)17(25)20-12(18(26)27)6-10-2-4-14(22)16(24)8-10/h1-4,7-8,11-12,20-24,26H,5-6,19H2
charge 0 multiplicity 1
47 atoms
O  -0.576917 0.866064 0.714673
O  -0.382605 3.24121 -2.436264
O  1.477057 4.487385 -1.834193
O  6.546999 -1.314077 -0.389175
O  -5.237588 0.872391 2.231044
O  5.435911 -2.100006 1.947403
O  -7.074254 -1.039244 1.748691
N  0.526139 0.969347 -1.337155
N  -0.363677 -1.380235 -2.15869
C  1.294989 2.16131 -1.015413
C  -1.154434 -0.785739 -1.049757
C  2.826245 1.978596 -1.201596
C  -1.60421 -1.783554 0.079237
C  -0.378535 0.421035 -0.461291
C  3.453952 0.868038 -0.365563
C  -3.054852 -1.621471 0.519223
C  0.842297 3.410126 -1.788113
C  4.676134 0.29727 -0.813196
C  2.909705 0.417826 0.863702
C  -3.477573 -0.439747 1.18542
C  -4.001506 -2.64362 0.256123
C  5.328175 -0.68003 -0.042644
C  3.566793 -0.568942 1.6350
C  -4.820305 -0.290239 1.572974
C  -5.355596 -2.498655 0.646767
C  4.779887 -1.123123 1.18949
C  -5.758572 -1.322871 1.301294
H  1.074186 2.382577 0.05069
H  -2.065983 -0.356947 -1.51096
H  3.295354 2.952342 -0.961816
H  3.035025 1.797045 -2.275244
H  -0.931684 -1.653817 0.94777
H  -1.459493 -2.8090 -0.309187
H  0.597163 0.474983 -2.239129
H  -0.939343 -1.868689 -2.851922
H  0.408368 -1.974136 -1.830303
H  5.116044 0.627378 -1.764774
H  1.961508 0.82075 1.234487
H  -2.756276 0.354182 1.406442
H  -3.684456 -3.563253 -0.248836
H  3.147655 -0.916043 2.583904
H  -6.080277 -3.297262 0.44208
H  -0.636299 4.101683 -2.86995
H  6.927496 -0.951665 -1.22425
H  -6.20694 0.791683 2.433994
H  6.274531 -2.354879 1.47989
H  -7.693935 -1.783078 1.559223
