program: Gaussian 09
title: 000216109
version: EM64L-G09RevD.01
frameworkgroup: C1[X(C9H15N5O)]
method: RPBEPBE
basis: SDD
operation: Freq
keyword: #p
keyword: freq=noraman
keyword: PBEPBE/SDD
title: #p freq=noraman PBEPBE/SDD
converged: NO YES NO NO
title: Mulliken charges:
elementType: O N N N N N C C C C C C C C C H H H H H H H H H H H H H H H
charge: -0.245700 -0.172973 -0.170504 -0.123900 -0.348865 -0.556808 -0.364075 -0.348962 -0.310186 -0.297944 0.251749 -0.442482 0.371545 -0.005644 -0.813533 0.216527 0.286819 0.199638 0.224737 0.196923 0.220660 0.218454 0.191750 0.223600 0.232768 0.245722 0.226291 0.313230 0.283038 0.298124
chargesum: 0.00000
title: Mulliken charges with hydrogens summed into heavy atoms:
elementType: O N N N N N C C C C C C C C C
charge: -0.245700 -0.172973 -0.170504 -0.123900 -0.035635 0.024354 0.139271 0.075413 0.107397 0.112260 0.251749 -0.218882 0.371545 -0.005644 -0.108752
polarizability: 2.21550261e+02 2.32401152e+00 1.32643897e+02 -3.22649593e+00 1.60951233e+00 8.56491271e+01
1716.lowfreq: -5.3922 -0.0006 -0.0003 0.0003 7.4390 10.3740 33.1792 36.4257 72.4723
frequency: 32.5238 36.2983 72.4564 117.7544 141.6812 179.4101 195.0416 209.7412 233.2708 247.0494 276.0180 285.0369 338.8178 379.4715 412.6183 423.9737 429.1679 455.2345 474.4230 515.1997 527.9763 578.1727 588.3358 626.1136 683.3920 730.3363 739.8463 785.9051 801.2954 832.2030 860.7172 872.8488 910.1752 941.0682 1003.2301 1018.6525 1033.7654 1043.2730 1051.1258 1076.7041 1102.5585 1122.0463 1145.0156 1175.7304 1191.2099 1200.0130 1207.8519 1240.3548 1253.8315 1277.2714 1290.8584 1294.8073 1327.8302 1340.7745 1360.2106 1368.8021 1371.7344 1395.7822 1431.1541 1445.4002 1451.0547 1453.1637 1456.5246 1462.1168 1466.6107 1486.8009 1530.6285 1595.3938 1658.0664 2932.4401 2945.6906 2950.0611 2962.3943 2975.5935 3057.1106 3078.7415 3079.4816 3082.4628 3087.4993 3089.2790 3145.8647 3417.4506 3475.4961 3581.5936
redmass: 4.9810 3.1054 4.2901 4.2495 3.7389 2.7680 1.1994 2.3921 2.4215 3.0207 3.0815 3.3315 2.2299 1.9119 1.8811 5.1916 4.9446 2.7071 3.0780 4.1432 1.7019 3.3560 2.9576 3.4487 3.7739 3.6388 3.8930 2.2971 3.2677 1.6992 1.5718 3.5776 2.3502 3.5160 1.7789 2.2855 2.2114 1.5457 2.0439 3.9419 2.2189 4.1485 3.2885 3.4343 1.2498 5.1650 1.6819 1.3564 1.3841 1.3200 1.8818 1.8332 1.2991 1.3442 1.4411 2.7231 1.4584 1.2399 2.0949 1.0854 1.1232 1.1011 1.1640 1.2237 1.1086 1.7088 3.1452 5.7118 1.0697 1.0706 1.0701 1.0663 1.0666 1.0364 1.0972 1.0956 1.0914 1.0995 1.0917 1.0981 1.0908 1.0456 1.0752 1.0988
irintensity: 0.1972 0.8193 6.8473 3.3131 14.0417 2.3410 0.7551 2.4270 2.1888 7.0104 12.5588 2.8634 1.2700 4.3089 20.1186 10.5837 3.6848 2.3412 74.1035 0.7646 306.5899 51.1795 5.7730 15.2450 24.7531 24.1987 44.5459 51.4680 56.4522 3.0144 22.0847 32.3044 4.7246 2.4213 50.8742 11.6560 6.0629 10.9713 21.8512 37.1394 15.0504 2.2354 78.9958 15.7836 4.0524 39.0018 77.4120 1.1655 41.9112 5.0310 32.8779 124.3290 3.4584 27.3076 3.7830 72.5163 19.1829 15.1622 3.3395 3.6829 62.2941 10.6912 16.6118 78.7489 16.8788 203.4641 49.6404 151.4955 21.4229 58.3770 53.4341 54.4854 103.4707 26.5193 15.2319 25.9470 41.5465 20.3739 17.6856 35.5827 18.5865 8.5877 22.2137 3.1029
temp: 298.150 k
press: 1.00000 atm
elementType: 8 7 7 7 7 7 6 6 6 6 6 6 6 6 6 1 1 1 1 1 1 1 1 1 1 1 1 1 1 1
symmnumber: 1
zpe: 646731.6 jmol-1
zpe.correction: 0.246327 hartree
zpe.thermalcorrener: 0.260889 hartree
zpe.thermalcorrenthalpy: 0.261833 hartree
zpe.thermalcorrgfe: 0.204401 hartree
zpe.sumelectzpe: -699.699236 hartree
zpe.sumelectthermal: -699.684675 hartree
zpe.sumelectthermalent: -699.683731 hartree
zpe.sumelectthermalfe: -699.741162 hartree
dipole: 0.7627 4.8202 0.7975
dipole: 4.9449
quadrupole: -95.1432 -86.4767 -88.6096
quadrupole: 9.0252 4.6226 0.2404
quadrupole: -5.0667 3.5998 1.4669 9.0252 4.6226 0.2404
hfenergy: -699.9455634 hartree
pointgroup: C01 [X(C9H15N5O1)]
dipole: 0.2986188 1.704348 0.8893275 debye
polarizability: 221.1347982|5.2902596|127.1026309|-6.552996|15.2041173|91.6058558 unknown
InChI: InChI=1S/C9H15N5O/c1-7-6-8(12-13-9(7)11-10)14-2-4-15-5-3-14/h6,11H,2-5,10H2,1H3
charge 0 multiplicity 1
30 atoms
O  -4.515198 0.008439 0.048494
N  -1.631961 -0.076528 0.025442
N  0.275207 -1.273717 -0.664246
N  1.62147 -1.394741 -0.846144
N  3.825744 -0.610094 -0.863188
N  4.853797 -0.370702 0.091585
C  -2.421652 -1.318848 -0.153445
C  -2.33995 0.974577 0.779114
C  -3.788658 -0.98595 -0.767865
C  -3.721216 1.239121 0.142463
C  -0.245711 -0.100993 -0.144966
C  0.606811 1.015845 0.138375
C  1.986758 0.914992 -0.080964
C  2.465703 -0.352087 -0.558743
C  2.903381 2.104196 0.10378
H  -2.570419 -1.812714 0.831408
H  -1.842523 -2.001573 -0.794709
H  -1.76739 1.916355 0.774993
H  -2.479675 0.66096 1.837678
H  -3.656554 -0.593035 -1.798979
H  -4.438331 -1.875863 -0.790372
H  -4.312667 1.928541 0.767779
H  -3.58307 1.678074 -0.870183
H  0.200666 1.969873 0.487179
H  3.536083 2.00532 1.005629
H  3.581302 2.203683 -0.764331
H  2.32199 3.037556 0.200283
H  3.940033 -1.508899 -1.346125
H  4.630815 -0.64024 1.05799
H  5.300213 0.542751 -0.00743
