program: Gaussian 09
title: 000210733
version: EM64L-G09RevD.01
frameworkgroup: C1[X(C18H28N2)]
method: RPBEPBE
basis: SDD
operation: Freq
keyword: #pfreq=noraman
keyword: PBEPBE/SDD
title: #p freq=noraman PBEPBE/SDD
converged: NO YES NO NO
title: Mulliken charges:
elementType: N N C C C C C C C C C C C C C C C C C C H H H H H H H H H H H H H H H H H H H H H H H H H H H H
charge: -0.174265 -0.054303 0.332639 -0.530745 -0.539493 -0.387732 -0.405092 -0.394439 0.283511 -0.359082 -0.360532 -0.398599 -0.394811 0.266506 -0.385847 -0.614615 -0.383742 -0.870662 -0.287167 -0.254921 0.184765 0.248057 0.211594 0.218204 0.189128 0.219810 0.215548 0.190236 0.202130 0.184501 0.189522 0.233284 0.201478 0.184929 0.185310 0.204777 0.203934 0.178310 0.244987 0.186076 0.220756 0.222077 0.226400 0.222620 0.217659 0.277812 0.224926 0.224560
chargesum: 0.00000
title: Mulliken charges with hydrogens summed into heavy atoms:
elementType: N N C C C C C C C C C C C C C C C C C C
charge: -0.174265 -0.054303 0.332639 -0.097923 -0.109694 0.021205 0.000693 -0.007808 0.283511 0.063723 0.025875 -0.008513 -0.012567 0.266506 -0.140860 0.014294 -0.157342 -0.152572 -0.062241 -0.030361
polarizability: 2.14336565e+02 1.31464401e+01 2.07175374e+02 -1.42763952e+01 2.23665465e+00 1.80071617e+02
1716.lowfreq: -13.3676 -4.9616 -0.0007 0.0001 0.0006 8.2742 30.1817 47.6178 56.6415
frequency: 28.5344 47.5532 56.5696 72.9575 118.2525 148.2995 160.9549 172.1429 212.9509 226.5123 230.8618 237.9271 252.9153 263.4580 283.8814 289.5665 300.5042 338.0274 359.3386 365.9734 378.0377 403.9316 440.7063 447.6302 466.5373 479.7054 491.8323 522.6936 532.6998 546.9794 572.5478 648.1238 667.2968 736.7427 752.2916 760.3058 772.0165 779.6754 807.9795 822.8004 851.7644 865.8051 875.1404 904.1361 906.4495 927.2672 936.6265 949.4274 962.5494 985.2769 990.2534 1006.0720 1023.8003 1046.5774 1047.3130 1048.7943 1053.1358 1064.7935 1075.1653 1075.2954 1087.1451 1095.9717 1106.4142 1125.3472 1132.8658 1135.2796 1147.1794 1148.5686 1175.3567 1182.7038 1191.1218 1194.7648 1210.4430 1231.6801 1256.3647 1267.9667 1277.6471 1286.4399 1289.8543 1299.1772 1303.1814 1324.8110 1332.4336 1337.8505 1342.2410 1350.7640 1353.2022 1355.6082 1359.5520 1370.5624 1374.6964 1384.4964 1427.3648 1427.5642 1450.2270 1450.8287 1457.0660 1459.1022 1463.1987 1464.0876 1465.3639 1471.2432 1473.9615 1477.3384 1480.0989 1481.2314 1493.1238 1504.1817 1578.7614 1608.4684 2834.6840 2840.8145 2858.2258 2873.0170 2884.7854 2960.8037 2965.2114 2974.3539 2980.4940 2982.9538 2993.7970 3014.9777 3017.4550 3022.5453 3025.1344 3026.7782 3037.3294 3047.1466 3049.1525 3065.1177 3070.1678 3073.8571 3084.9524 3097.7923 3110.6654 3127.0442 3151.0098 3174.8382
redmass: 2.7485 3.5781 3.7027 3.7124 3.1015 2.9226 2.6279 3.1714 1.4288 1.9789 2.0475 1.5820 3.0097 1.8414 2.5721 3.1745 1.9523 2.2628 2.5368 2.3465 2.1015 2.2913 3.3515 3.0145 2.9493 2.3413 2.7604 3.0310 2.3217 3.9881 3.4620 3.0153 3.3561 2.8419 1.9333 2.0183 2.8935 1.5282 2.9243 3.1882 1.5469 1.8526 1.3851 2.2615 2.1552 1.5315 1.8537 1.4189 2.7707 1.3289 1.5670 2.4293 2.6927 1.7923 1.8063 1.6078 2.0339 1.8930 1.9930 1.6841 2.1326 1.7229 1.7605 1.8784 1.9434 1.8896 2.7026 2.4036 1.1200 2.1178 1.6593 1.1416 2.1930 2.3424 1.3653 1.3242 1.4197 1.6643 1.5305 1.5386 1.3295 1.2892 1.3378 1.3916 1.4026 1.4199 1.4365 3.9080 1.4564 1.4221 1.3317 1.2435 1.9274 1.1882 1.0824 1.0876 1.1379 1.1244 1.1416 1.0936 1.0873 1.1051 1.1027 1.1365 1.0586 1.5939 1.1211 1.0753 5.9652 6.0005 1.0697 1.0647 1.0622 1.0701 1.0692 1.0628 1.0385 1.0614 1.0610 1.0636 1.0687 1.0726 1.0876 1.0899 1.0957 1.0982 1.1016 1.0951 1.1007 1.0883 1.0871 1.1009 1.0999 1.0918 1.0868 1.0889 1.0970 1.0935
irintensity: 0.0178 0.2192 0.1561 0.5257 0.4974 1.3529 0.3967 0.3895 0.2615 0.3415 1.0688 0.4826 0.1913 0.4948 2.7827 4.6648 1.7134 9.9423 1.3722 1.0796 0.2400 0.0813 1.4619 1.5930 6.5905 1.7676 0.9277 6.2161 0.3408 0.5791 0.9766 8.0834 1.6049 8.0514 40.4351 27.4705 0.8455 1.7914 5.8222 6.2576 0.2411 11.5541 4.6867 12.1333 2.1918 1.8605 6.6324 1.9827 43.6196 0.6913 4.1077 42.6615 10.9256 0.8945 3.7296 5.5713 6.4524 3.8902 1.0245 4.6322 4.5073 31.7773 8.7785 9.3952 3.5732 7.3587 36.6524 21.1949 2.0917 7.5089 2.1079 1.1151 0.6870 3.5624 5.0960 10.7768 6.4103 2.5465 8.0367 23.0774 4.8179 1.5794 6.9129 1.6515 0.6201 1.6746 3.9404 1.6960 6.9217 2.0937 7.6757 18.4241 4.1411 1.3258 1.7872 3.0700 18.3910 19.0911 3.2681 5.6818 9.2569 7.5792 19.8142 7.6606 5.6569 28.7830 5.5718 8.7950 0.5376 1.7674 59.7182 50.1118 144.0778 66.1856 157.8394 34.6364 38.5116 23.5583 44.5586 42.6748 35.0676 42.2132 58.3402 57.6418 44.2510 65.2102 12.8535 23.0412 112.4893 28.6566 29.8482 37.1118 2.8881 16.7536 10.0352 14.3239 41.4232 16.2279
temp: 298.150 k
press: 1.00000 atm
elementType: 7 7 6 6 6 6 6 6 6 6 6 6 6 6 6 6 6 6 6 6 1 1 1 1 1 1 1 1 1 1 1 1 1 1 1 1 1 1 1 1 1 1 1 1 1 1 1 1
symmnumber: 1
zpe: 1117332.2 jmol-1
zpe.correction: 0.425569 hartree
zpe.thermalcorrener: 0.444628 hartree
zpe.thermalcorrenthalpy: 0.445572 hartree
zpe.thermalcorrgfe: 0.379333 hartree
zpe.sumelectzpe: -810.633376 hartree
zpe.sumelectthermal: -810.614317 hartree
zpe.sumelectthermalent: -810.613373 hartree
zpe.sumelectthermalfe: -810.679612 hartree
dipole: -0.2583 -0.3089 0.3831
dipole: 0.5558
quadrupole: -121.9868 -118.6993 -120.8244
quadrupole: -0.2241 -4.4135 -0.9438
quadrupole: -1.4833 1.8042 -0.3209 -0.2241 -4.4135 -0.9438
hfenergy: -811.0589451 hartree
pointgroup: C01 [X(C18H28N2)]
dipole: -0.1164222 0.1079852 -0.150329 debye
polarizability: 217.6560538|-11.8475686|203.2060204|14.1281774|4.6819239|180.7214809 unknown
InChI: InChI=1S/C18H28N2/c1-16-8-4-5-9-17(16)18(10-6-3-7-11-18)20-14-12-19(2)13-15-20/h4-5,8-9H,3,6-7,10-15H2,1-2H3
charge 0 multiplicity 1
48 atoms
N  -1.159432 0.237631 -0.078488
N  -3.91278 -0.585364 0.367185
C  0.238448 0.835229 0.014412
C  0.537179 1.695353 -1.258603
C  0.340217 1.819567 1.237745
C  1.907014 2.408688 -1.192813
C  1.631431 2.680175 1.313495
C  1.931588 3.409189 -0.015859
C  1.232368 -0.368534 0.093398
C  -1.533036 -0.644818 1.058562
C  -2.291449 1.149063 -0.377958
C  -2.776083 -1.475564 0.698506
C  -3.544637 0.327112 -0.738166
C  1.352429 -1.346759 -0.953988
C  2.030764 -0.55298 1.255146
C  -5.155817 -1.329856 0.095332
C  2.286883 -2.406272 -0.79909
C  0.516752 -1.362522 -2.229135
C  2.951913 -1.612424 1.393535
C  3.094938 -2.54647 0.347757
H  -0.231362 2.48823 -1.34408
H  0.460806 1.078761 -2.166257
H  0.193591 1.276731 2.190971
H  -0.520527 2.513059 1.149409
H  2.089001 2.937179 -2.148956
H  2.720416 1.665998 -1.074478
H  2.503559 2.048892 1.5655
H  1.524576 3.415369 2.136163
H  2.911511 3.920828 0.045428
H  1.167397 4.194714 -0.193614
H  -1.764872 -0.059584 1.981551
H  -0.69384 -1.32464 1.281214
H  -2.045759 1.790095 -1.240164
H  -2.548708 1.809816 0.486485
H  -2.520011 -2.152573 -0.157684
H  -3.060859 -2.107213 1.561586
H  -4.391053 1.015405 -0.926638
H  -3.339147 -0.237415 -1.685653
H  1.925211 0.137958 2.094454
H  -5.08266 -2.00654 -0.794798
H  -5.98437 -0.620539 -0.082899
H  -5.417516 -1.948794 0.972615
H  2.366701 -3.146061 -1.60593
H  0.996457 -0.778252 -3.038865
H  0.414897 -2.398455 -2.60006
H  -0.487225 -0.948235 -2.042506
H  3.543477 -1.705681 2.311319
H  3.804618 -3.377594 0.428217
