program: Gaussian 09
title: 000210731
version: EM64L-G09RevD.01
frameworkgroup: C1[X(C15H24N2S)]
method: RPBEPBE
basis: SDD
operation: Freq
keyword: #p
keyword: freq=noraman
keyword: PBEPBE/SDD
title: #p freq=noraman PBEPBE/SDD
converged: YES YES NO NO
title: Mulliken charges:
elementType: S N N C C C C C C C C C C C C C C C H H H H H H H H H H H H H H H H H H H H H H H H
charge: 0.208967 -0.167022 -0.051712 0.442107 -0.530009 -0.504678 -0.395123 -0.395052 -0.396680 -0.376591 -0.346062 -0.136340 -0.394373 -0.398246 -0.284900 -0.615140 -0.163477 -0.515465 0.212372 0.225110 0.216360 0.188601 0.217084 0.189531 0.185624 0.219756 0.189414 0.198442 0.216095 0.209096 0.192459 0.216891 0.179546 0.205528 0.204908 0.179168 0.245657 0.185147 0.221901 0.222402 0.239462 0.259241
chargesum: 0.00000
title: Mulliken charges with hydrogens summed into heavy atoms:
elementType: S N N C C C C C C C C C C C C C C C
charge: 0.208967 -0.167022 -0.051712 0.442107 -0.092526 -0.099716 0.011492 0.010328 -0.008824 0.048600 0.063288 -0.136340 -0.009299 -0.014171 -0.039242 0.014310 0.075985 -0.256224
polarizability: 1.97060044e+02 -2.04877789e+01 1.85818385e+02 5.92144476e+00 8.84747252e-01 1.72340058e+02
1716.lowfreq: -16.5746 -5.3654 -0.0016 -0.0014 -0.0011 13.0200 19.8079 43.3542 62.0635
frequency: 19.3279 43.2956 61.9792 79.3184 124.4225 135.5721 143.9170 205.5674 213.0757 227.3623 251.8667 265.9814 270.3505 291.3365 304.9875 344.8660 355.0053 368.0436 405.1429 415.2095 439.8679 483.5838 497.0554 503.4713 523.0659 567.6998 601.4977 605.3824 661.1253 687.5739 688.4330 752.8509 761.1206 780.5314 796.3889 826.4388 831.5903 852.7929 865.9804 880.2841 903.1997 907.3292 925.8729 938.0182 962.7078 976.0932 1010.5851 1040.4633 1048.9836 1058.1750 1062.8233 1075.6548 1076.8699 1079.5454 1091.7481 1098.9004 1128.7834 1131.4798 1133.6176 1148.6477 1150.0266 1156.5136 1190.8752 1199.9750 1224.1324 1242.1176 1257.2921 1266.3762 1272.8551 1286.9420 1289.7126 1310.9257 1317.4508 1327.8483 1339.2635 1340.1822 1341.5553 1347.8651 1355.4918 1356.6539 1371.6612 1376.0347 1428.9636 1450.8068 1454.4053 1455.8990 1459.1230 1462.2682 1465.2011 1467.8835 1472.5401 1473.5212 1476.0821 1480.7498 1488.3148 1535.3067 2834.8283 2838.8915 2858.1498 2904.4517 2912.5472 2961.3276 2981.3406 2982.9469 2988.5982 2992.9505 3015.6225 3020.0736 3024.1917 3026.4620 3033.4007 3039.9238 3045.1346 3054.4347 3064.3427 3070.7944 3074.1517 3164.7184 3182.5878 3234.5755
redmass: 4.6910 3.8041 3.4099 3.8997 3.4711 3.9951 2.6605 2.9655 1.7113 1.5700 3.5971 4.1485 2.1587 1.9284 3.1968 2.2327 2.6028 2.4350 2.1407 2.9317 3.2501 2.9170 2.4913 1.8716 3.4678 2.8162 5.7728 4.0249 2.8881 3.7841 1.3008 3.4021 3.0000 1.5024 3.1808 1.6125 2.6225 1.5410 1.8872 2.2002 1.5194 1.8391 1.9265 1.6935 2.7430 2.6173 2.4207 1.9526 1.6169 1.8939 1.6804 1.6572 1.4903 1.3751 1.7097 1.6331 1.8703 2.9515 2.3992 2.4017 2.7078 1.9337 1.6195 1.1323 1.5150 2.2112 1.3135 1.3388 1.2696 1.4521 1.6234 1.3184 1.3682 2.0328 1.3229 1.4294 1.4218 1.4038 1.4063 1.4321 1.3880 1.3818 1.1720 1.0851 1.0783 1.0786 1.0651 1.0821 1.0879 1.0959 1.0962 5.8088 1.1442 1.0548 1.0885 5.3006 1.0707 1.0647 1.0616 1.0698 1.0687 1.0626 1.0600 1.0611 1.0622 1.0635 1.0723 1.0877 1.0899 1.0961 1.0992 1.0998 1.1026 1.1017 1.0885 1.0888 1.1009 1.0890 1.0969 1.1002
irintensity: 0.1924 0.4234 0.0431 0.4039 0.9701 0.1375 0.1129 2.2785 0.3186 0.3571 1.1264 0.2986 0.4474 1.6131 1.3150 20.0298 1.1557 1.1949 1.1845 0.4678 2.6131 0.2368 0.8428 2.1125 9.4542 0.5280 2.2860 3.4477 1.6540 10.0634 97.9804 9.9751 23.7639 1.5539 8.3734 11.7160 6.2152 0.1143 2.2470 1.7633 1.0152 3.1043 1.3628 6.8929 53.6390 14.3312 24.0962 5.9804 1.6516 7.3451 1.5713 2.8714 3.2043 0.8036 16.3313 1.6460 2.9946 16.4816 1.5421 26.8086 28.3181 11.9356 2.2296 0.4127 26.1104 7.9524 7.9934 3.7564 1.2104 10.4616 25.3597 1.8028 2.1126 0.9196 0.2748 0.6347 2.2876 1.9234 1.5303 1.3924 0.3261 5.7547 1.2662 5.7337 0.6575 0.5099 25.9856 9.6259 7.0551 23.7206 15.1879 18.0882 5.2036 9.0320 22.2476 2.2058 56.9254 48.1016 218.5623 31.5441 81.4660 39.7690 27.6039 42.7572 51.1197 17.3093 44.2986 52.6709 66.3783 55.0337 36.4425 8.2447 3.9576 118.1173 42.8390 22.3145 35.7901 9.7049 6.3264 1.3450
temp: 298.150 k
press: 1.00000 atm
elementType: 16 7 7 6 6 6 6 6 6 6 6 6 6 6 6 6 6 6 1 1 1 1 1 1 1 1 1 1 1 1 1 1 1 1 1 1 1 1 1 1 1 1
symmnumber: 1
zpe: 957802.8 jmol-1
zpe.correction: 0.364808 hartree
zpe.thermalcorrener: 0.382217 hartree
zpe.thermalcorrenthalpy: 0.383161 hartree
zpe.thermalcorrgfe: 0.319455 hartree
zpe.sumelectzpe: -1092.107636 hartree
zpe.sumelectthermal: -1092.090226 hartree
zpe.sumelectthermalent: -1092.089282 hartree
zpe.sumelectthermalfe: -1092.152988 hartree
dipole: -0.5964 0.6081 0.7320
dipole: 1.1231
quadrupole: -114.3314 -118.1959 -112.3867
quadrupole: -2.0256 2.1910 -0.7303
quadrupole: 0.6400 -3.2246 2.5846 -2.0256 2.1910 -0.7303
hfenergy: -1092.4724435 hartree
pointgroup: C01 [X(C15H24N2S1)]
dipole: 0.1339623 0.2975242 -0.2979658 debye
polarizability: 182.5758901|19.4051015|200.4781336|5.2049411|0.2007243|172.1644628 unknown
InChI: InChI=1S/C15H24N2S/c1-16-9-11-17(12-10-16)15(7-3-2-4-8-15)14-6-5-13-18-14/h5-6,13H,2-4,7-12H2,1H3
charge 0 multiplicity 1
42 atoms
S  -1.640338 -2.093153 1.393363
N  0.558246 0.367053 -0.003171
N  3.372335 -0.374539 0.039288
C  -0.959116 0.376969 -0.016854
C  -1.507045 1.114147 1.247805
C  -1.451639 1.204951 -1.252234
C  -1.035028 2.582462 1.340298
C  -0.975999 2.674013 -1.202765
C  -1.458205 3.380467 0.085081
C  1.2234 -0.074184 1.250289
C  1.201149 -0.311826 -1.159634
C  -1.531882 -1.041497 -0.096278
C  2.723273 0.272586 1.200557
C  2.699678 0.034726 -1.213423
C  -1.939414 -1.772995 -1.206093
C  4.828289 -0.148907 0.003553
C  -2.340445 -3.130697 -0.92545
C  -2.242123 -3.469545 0.412818
H  -1.252241 0.562989 2.172334
H  -2.612345 1.088282 1.177957
H  -2.558961 1.1692 -1.250828
H  -1.127663 0.739896 -2.201107
H  0.067063 2.614718 1.435548
H  -1.459792 3.047908 2.251302
H  -1.349868 3.210926 -2.096773
H  0.129731 2.695404 -1.23721
H  -2.564844 3.468078 0.063509
H  -1.054561 4.410438 0.131183
H  1.117982 -1.172195 1.417531
H  0.779951 0.447835 2.113843
H  0.731099 0.026503 -2.098095
H  1.090757 -1.419766 -1.101154
H  2.831877 1.388518 1.162209
H  3.21047 -0.087866 2.126613
H  3.168156 -0.502536 -2.060168
H  2.809409 1.135797 -1.397748
H  -1.965374 -1.348409 -2.212615
H  5.108984 0.93075 -0.1026
H  5.269692 -0.701034 -0.845871
H  5.286871 -0.530188 0.933914
H  -2.690852 -3.82631 -1.69222
H  -2.473977 -4.411668 0.906494
