program: Gaussian 09
title: 000210727
version: EM64L-G09RevD.01
frameworkgroup: C1[X(C11H16N2O4)]
method: RPBEPBE
basis: SDD
operation: Freq
keyword: #p
keyword: freq=noraman
keyword: PBEPBE/SDD
title: #p freq=noraman PBEPBE/SDD
converged: YES YES NO NO
title: Mulliken charges:
elementType: O O O O N N C C C C C C C C C C C H H H H H H H H H H H H H H H H
charge: -0.446749 -0.239020 -0.237935 -0.236284 -0.189104 -0.363351 0.115039 -0.488792 -0.528147 0.211733 -0.062355 0.129436 0.192261 -0.723234 -0.028574 -0.596107 -0.593483 0.230019 0.256058 0.253370 0.227866 0.252301 0.362421 0.209463 0.241526 0.221731 0.260578 0.259725 0.255542 0.260604 0.351178 0.222309 0.219977
chargesum: 0.00000
title: Mulliken charges with hydrogens summed into heavy atoms:
elementType: O O O O N N C C C C C C C C C C C
charge: -0.095572 -0.239020 -0.237935 -0.236284 -0.189104 -0.000930 0.115039 -0.002715 -0.046911 0.211733 0.189946 0.129436 0.192261 -0.050515 0.232004 0.179763 -0.151197
polarizability: 1.77306070e+02 1.32514372e+01 1.27344905e+02 1.75635527e+00 -8.01938996e+00 1.30240982e+02
1716.lowfreq: -76.2836 -8.6582 -4.5767 -0.0008 -0.0006 -0.0005 10.4895 31.8743 57.3176
frequency: -76.2650 31.7853 57.2858 66.7255 73.1454 77.8053 102.4892 126.7962 160.3872 168.7268 195.9392 225.1950 242.9976 258.9296 270.1080 300.5395 338.0745 344.1585 370.0001 390.6876 413.9162 435.3827 443.8244 447.8353 489.8338 514.5471 583.0239 624.1146 656.9623 670.7914 706.5900 713.8930 743.7184 774.1113 798.0428 850.8030 879.3155 896.5694 931.6805 935.3871 955.2212 975.1780 986.7394 1004.0590 1032.7813 1069.5828 1081.3997 1098.7352 1128.4737 1146.6548 1161.3536 1169.2260 1208.4561 1247.5153 1265.3544 1289.9482 1296.3630 1301.0217 1313.8658 1333.5629 1355.9351 1362.9822 1378.3022 1385.9215 1387.7630 1425.3356 1428.7212 1441.0935 1459.9849 1464.6218 1468.1091 1471.7594 1490.2594 1580.6481 1632.1374 1655.4514 1656.4063 2965.3315 2975.8888 3006.1213 3018.2440 3046.8534 3051.1833 3070.8007 3085.5861 3087.3962 3094.9781 3115.0664 3118.2781 3152.9468 3197.4560 3520.9339 3530.5197
redmass: 1.0421 6.5385 3.9919 2.9165 3.4461 3.4114 3.6483 4.8388 6.2104 5.3519 3.8532 1.1486 3.4766 3.3079 3.8545 3.0549 3.3490 2.8162 9.0108 5.4317 2.3383 1.7684 2.1434 3.1270 2.8120 3.7796 5.1875 1.9969 2.6771 4.1696 6.9778 5.7458 4.3320 1.8150 3.3728 2.4132 2.0180 2.2524 1.7287 2.4614 1.3510 1.6964 2.9015 1.1701 2.0736 2.0819 2.8514 2.0700 1.3535 2.4734 2.3576 3.5373 1.5548 2.3774 1.8209 1.3204 1.3149 1.3630 1.4237 3.2658 1.7179 2.9329 1.9425 1.2087 1.2055 1.2144 1.2029 1.0956 1.0991 1.1175 1.0511 1.0505 1.0687 10.4399 6.3752 4.6608 7.1947 1.0631 1.0375 1.0625 1.0353 1.0976 1.0879 1.0978 1.0985 1.0606 1.0992 1.0987 1.0939 1.1036 1.1143 1.0767 1.0658
irintensity: 0.0254 1.8607 3.9186 0.4607 0.0935 0.1819 0.5384 0.4098 10.3447 15.0437 0.6443 0.5870 6.5200 2.8523 5.1312 7.1962 3.3514 3.2544 29.8426 28.0072 3.6252 114.1371 31.1970 46.2904 48.5348 33.7660 0.5335 4.1703 22.6572 3.0704 2.1303 2.9354 2.9950 110.0182 13.3593 7.3512 6.9530 1.0117 7.8322 13.1969 82.3025 40.2957 17.9766 10.4297 3.3840 83.0345 13.4018 16.6169 5.6649 19.5042 5.4119 35.6848 7.8289 11.8118 25.5159 1.7076 19.7728 21.8218 19.3302 278.2305 52.6834 108.8718 14.9422 45.3569 12.6037 103.2720 20.8506 26.0507 14.4215 29.1059 12.6959 11.9315 12.9041 344.8620 294.3427 20.1940 290.5190 17.9077 19.4920 9.3116 20.0815 7.4117 3.0019 15.0551 23.1709 8.9183 26.2046 10.7855 4.1745 0.3963 19.5218 65.4949 8.7404
temp: 298.150 k
press: 1.00000 atm
elementType: 8 8 8 8 7 7 6 6 6 6 6 6 6 6 6 6 6 1 1 1 1 1 1 1 1 1 1 1 1 1 1 1 1
symmnumber: 1
zpe: 690607.9 jmol-1
zpe.correction: 0.263039 hartree
zpe.thermalcorrener: 0.280349 hartree
zpe.thermalcorrenthalpy: 0.281293 hartree
zpe.thermalcorrgfe: 0.217798 hartree
zpe.sumelectzpe: -837.888652 hartree
zpe.sumelectthermal: -837.871342 hartree
zpe.sumelectthermalent: -837.870397 hartree
zpe.sumelectthermalfe: -837.933892 hartree
dipole: 1.8635 1.2418 -0.1034
dipole: 2.2417
quadrupole: -103.5646 -100.3387 -104.4485
quadrupole: -3.6165 1.9680 0.8196
quadrupole: -0.7806 2.4452 -1.6646 -3.6165 1.9680 0.8196
hfenergy: -838.1516903 hartree
pointgroup: C01 [X(C11H16N2O4)]
dipole: -0.5748579 -0.6620656 0.0951715 debye
polarizability: 166.4923646|23.2649|139.9098767|-9.2184831|4.8120961|128.489716 unknown
InChI: InChI=1S/C11H16N2O4/c1-4-5-11(6-7(2)14)8(15)12-10(17)13(3)9(11)16/h4,7,12,14H,1,5-6H2,2-3H3
charge 0 multiplicity 1
33 atoms
O  -1.216237 2.243724 -0.604845
O  0.157574 -1.196995 -1.851972
O  -0.701372 1.263607 2.213622
O  3.478446 1.337958 0.226827
N  1.845311 -0.008024 -0.788222
N  1.382071 1.198903 1.219188
C  -0.382997 -0.342564 0.373492
C  -1.849152 -0.116644 -0.079589
C  -0.281831 -1.663553 1.262727
C  0.531906 -0.531597 -0.847406
C  -2.014008 1.073786 -1.052823
C  0.047132 0.791595 1.313061
C  2.312045 0.868533 0.218045
C  -3.488816 1.451895 -1.256751
C  -0.802229 -2.917015 0.592848
C  2.777288 -0.293389 -1.906755
C  -1.736043 -3.732376 1.14351
H  -2.454806 0.049339 0.831993
H  -2.214238 -1.034548 -0.571504
H  -0.848409 -1.466471 2.191597
H  0.781551 -1.804129 1.548852
H  -1.55371 0.819825 -2.022578
H  1.709259 1.88994 1.902092
H  -3.95977 1.744862 -0.298366
H  -3.573751 2.297031 -1.961074
H  -4.0596 0.59847 -1.666655
H  -0.369674 -3.16957 -0.384687
H  3.797029 -0.383809 -1.50541
H  2.755305 0.526297 -2.645018
H  2.452928 -1.224167 -2.392782
H  -1.603226 2.585541 0.243721
H  -2.060448 -4.649981 0.640278
H  -2.199327 -3.509774 2.113281
