program: Gaussian 09
title: 000210726
version: EM64L-G09RevD.01
frameworkgroup: C1[X(C13H12N4OS)]
method: RPBEPBE
basis: SDD
operation: Freq
keyword: #p
keyword: freq=noraman
keyword: PBEPBE/SDD
title: #p freq=noraman PBEPBE/SDD
converged: YES YES NO NO
title: Mulliken charges:
elementType: S O N N N N C C C C C C C C C C C C C H H H H H H H H H H H H
charge: 0.310094 -0.230633 -0.024050 0.018143 -0.058434 -0.682524 0.122802 -0.827239 0.361859 0.144858 -0.385499 -0.366150 -0.357660 0.117619 -0.439367 -0.413411 0.508130 -0.383258 -0.505153 0.299705 0.268058 0.209041 0.288561 0.220130 0.221668 0.246126 0.313614 0.312054 0.240548 0.240028 0.230341
chargesum: 0.00000
title: Mulliken charges with hydrogens summed into heavy atoms:
elementType: S O N N N N C C C C C C C C C C C C C
charge: 0.310094 -0.230633 -0.024050 0.018143 -0.058434 -0.056856 0.122802 -0.259476 0.361859 0.144858 -0.385499 -0.157108 -0.069099 0.117619 -0.219238 -0.191743 0.508130 -0.137132 0.205764
polarizability: 4.05352412e+02 -7.05925599e+00 2.04790102e+02 -7.02487282e+00 -6.25693694e+00 9.37705950e+01
1716.lowfreq: -0.0011 -0.0011 -0.0009 1.6158 5.6869 7.5306 31.2954 39.6667 70.4531
frequency: 31.2627 39.6561 70.4477 77.3816 109.6263 139.6935 144.0638 161.5258 197.4803 222.6833 256.0395 284.0248 294.1268 345.2956 354.7494 369.7077 382.0881 405.1229 413.6683 419.5692 440.4953 493.7156 507.6577 513.5713 560.4063 594.1163 612.9021 627.4798 636.1643 684.3485 697.2443 734.8792 765.3571 773.8737 809.9440 812.8538 825.2513 839.4913 847.9361 910.4369 912.4297 941.3356 981.4459 993.6441 998.8064 1012.2811 1024.9532 1110.9697 1122.3066 1131.8765 1145.5988 1168.6598 1183.5316 1193.6585 1240.3393 1264.2869 1283.4055 1299.8178 1313.0966 1332.0744 1354.1647 1382.9686 1388.8895 1428.3904 1435.1813 1449.1061 1451.5609 1460.7642 1467.2047 1489.2586 1521.4667 1534.4168 1570.5283 1631.4841 1646.0875 3003.2720 3027.6100 3106.2645 3121.9749 3124.1107 3138.0289 3143.8386 3153.1166 3165.5836 3169.7871 3558.1609 3697.8880
redmass: 3.9772 4.9829 4.7447 6.1461 3.7570 1.8763 2.9380 2.1793 5.2340 6.9337 5.8804 4.4661 3.8312 5.3337 5.5436 4.7227 5.8042 1.6118 1.4196 1.2704 4.9572 3.5760 5.0309 6.0415 4.0849 4.4362 9.3693 5.9652 6.7559 8.1135 5.7518 3.5523 6.1885 7.6139 1.7367 4.0138 5.5945 3.4718 2.0800 1.5488 2.0517 1.3992 6.0773 3.8197 1.3473 2.0884 1.8438 1.2564 2.8816 1.3182 1.5473 1.3858 3.6980 1.1921 1.3018 4.7501 9.7093 2.8280 1.6057 2.3838 4.3613 2.3521 2.2631 1.8298 1.1692 1.0537 3.8397 1.1650 2.6420 6.1036 3.6255 7.8984 6.3482 3.4089 1.3979 1.0289 1.0647 1.1044 1.0887 1.0890 1.0988 1.1051 1.0938 1.0949 1.0922 1.0450 1.1040
irintensity: 0.2072 0.5407 2.2548 2.9464 0.8252 1.2831 2.6317 4.3564 1.5341 2.6119 2.6618 2.2898 4.4646 3.7186 2.8707 8.9307 2.0942 1.4791 1.5172 311.5615 4.7812 7.7781 9.2517 4.6903 7.7406 15.2310 1.2957 8.8874 0.8138 3.6983 5.1209 0.2712 3.5801 9.4728 15.3047 5.4517 2.4799 40.2431 38.3061 12.5077 2.2488 0.6720 94.1623 43.2751 0.6625 21.8105 15.0736 0.3984 26.3003 18.8076 13.3734 4.9904 22.5430 134.1016 30.8532 144.8444 25.5022 59.9387 13.8466 124.9070 109.8589 40.7751 61.1911 12.7739 22.5764 11.3297 50.6987 117.6534 100.6489 114.3761 172.0425 344.3357 39.7110 171.6347 455.9308 64.9029 17.5818 26.4643 10.6097 36.6924 0.3325 18.0379 23.8110 6.5539 16.2092 183.6114 23.8672
temp: 298.150 k
press: 1.00000 atm
elementType: 16 8 7 7 7 7 6 6 6 6 6 6 6 6 6 6 6 6 6 1 1 1 1 1 1 1 1 1 1 1 1
symmnumber: 1
zpe: 608193.2 jmol-1
zpe.correction: 0.231649 hartree
zpe.thermalcorrener: 0.248371 hartree
zpe.thermalcorrenthalpy: 0.249315 hartree
zpe.thermalcorrgfe: 0.186526 hartree
zpe.sumelectzpe: -1193.515726 hartree
zpe.sumelectthermal: -1193.499004 hartree
zpe.sumelectthermalent: -1193.498059 hartree
zpe.sumelectthermalfe: -1193.560848 hartree
dipole: -6.8002 2.2972 1.1477
dipole: 7.2689
quadrupole: -81.1591 -109.5269 -119.7810
quadrupole: 6.7243 3.9828 -6.6384
quadrupole: 22.3299 -6.0379 -16.2920 6.7243 3.9828 -6.6384
hfenergy: -1193.7473744 hartree
pointgroup: C01 [X(C13H12N4O1S1)]
dipole: 2.673902 -0.932205 0.3996652 debye
polarizability: 405.3242698|-7.7438577|203.7118406|6.7803028|12.6362221|94.876998 unknown
InChI: InChI=1S/C13H12N4OS/c1-18-12-11-13(16-7-15-12)19-6-10(17-11)8-2-4-9(14)5-3-8/h2-5,7H,6,14H2,1H3
charge 0 multiplicity 1
31 atoms
S  -1.193339 2.83581 -0.028947
O  -2.335265 -2.238386 0.299737
N  -0.406951 -0.229674 0.036434
N  -3.621248 1.652446 -0.402523
N  -4.073732 -0.724408 -0.21124
N  5.997765 -0.84368 -0.397408
C  0.517938 0.650053 0.40197
C  0.100297 1.96494 1.054974
C  1.937651 0.306059 0.209238
C  -1.767132 0.086059 0.041777
C  -2.310298 1.400234 -0.124917
C  3.011332 1.179808 0.54871
C  2.275824 -0.971592 -0.337783
C  -2.760043 -0.957321 0.036205
C  4.351035 0.808548 0.351423
C  3.605187 -1.353798 -0.53779
C  4.675179 -0.467042 -0.19743
C  -4.439342 0.569995 -0.450114
C  -3.364298 -3.302505 0.249663
H  -0.36933 1.777454 2.036639
H  0.91552 2.689195 1.174819
H  2.81424 2.171713 0.968449
H  1.452157 -1.645969 -0.590956
H  5.155688 1.50425 0.618264
H  3.83481 -2.341059 -0.957308
H  -5.49002 0.75087 -0.692789
H  6.226662 -1.749831 -0.796664
H  6.762153 -0.21783 -0.158779
H  -3.832424 -3.341342 -0.748158
H  -4.146892 -3.120124 1.004944
H  -2.805719 -4.224274 0.466859
