program: Gaussian 09
title: 000012569
version: EM64L-G09RevD.01
frameworkgroup: C1[X(C14H10O2S2)]
method: RPBEPBE
basis: SDD
operation: Freq
keyword: #p
keyword: freq=noraman
keyword: PBEPBE/SDD
title: #p freq=noraman PBEPBE/SDD
converged: YES YES NO NO
title: Mulliken charges:
elementType: S S O O C C C C C C C C C C C C C C H H H H H H H H H H
charge: 0.076699 -0.021893 -0.138798 -0.168787 0.445302 0.424158 -0.352973 -0.353917 -0.327619 -0.305444 -0.218224 -0.214917 -0.232866 -0.224728 -0.219664 -0.217607 -0.248475 -0.223365 0.265137 0.272970 0.305633 0.252791 0.237195 0.238736 0.238541 0.238156 0.235405 0.238552
chargesum: 0.00000
title: Mulliken charges with hydrogens summed into heavy atoms:
elementType: S S O O C C C C C C C C C C C C C C
charge: 0.076699 -0.021893 -0.138798 -0.168787 0.445302 0.424158 -0.087836 -0.080946 -0.021986 -0.052653 0.018971 0.023819 0.005675 0.013428 0.015742 0.020945 -0.248475 -0.223365
polarizability: 2.96037687e+02 2.78020244e+01 1.82278338e+02 3.06260421e+00 9.35402038e+00 1.33935933e+02
1716.lowfreq: -8.0753 -0.0017 -0.0016 0.0014 2.1982 4.7238 17.6681 20.6809 38.1353
frequency: 17.3915 20.3873 38.0981 57.4455 73.3618 92.1472 115.3548 131.4446 159.8193 173.3856 197.2842 270.0374 303.5560 348.0906 386.3447 394.6888 396.8358 410.0163 426.0850 431.7607 500.0887 515.6869 609.8602 611.0702 625.0940 632.7915 656.4884 662.7940 692.0994 703.3999 783.0133 783.9780 851.1221 856.7036 859.8467 867.5933 945.0275 954.6594 987.1742 988.2308 989.9168 995.5401 1008.4302 1013.7637 1025.1823 1027.2626 1088.6270 1089.8391 1176.3697 1176.5684 1184.5015 1195.0272 1203.2088 1210.0645 1319.5580 1326.3486 1385.8828 1387.6887 1434.6917 1434.7833 1473.9791 1476.2358 1580.0219 1581.1115 1603.6656 1605.6766 1614.6814 1619.8341 3131.8911 3132.9997 3139.3212 3139.8903 3148.4708 3150.8866 3159.5889 3162.8710 3171.1060 3173.2186
redmass: 5.1440 4.7471 6.7651 7.0207 10.1190 5.4647 12.6631 7.2743 5.9504 5.6566 8.8928 7.4014 9.9627 15.7697 9.8040 4.3878 3.0439 3.1979 4.9025 8.2293 7.3036 9.4357 6.4152 6.4405 5.2230 5.0445 7.8240 7.5524 1.7809 1.8238 1.8524 1.8821 6.7480 1.2626 4.2913 1.4066 1.4142 1.3955 4.9367 4.6343 1.5029 1.4271 1.3408 1.3315 2.2038 2.2012 1.5795 1.6042 1.0616 1.0640 1.4917 1.1514 2.0553 3.9339 1.3144 1.3043 8.4217 9.0136 2.2468 2.2458 2.1528 2.1521 6.3011 6.0889 6.1975 5.8957 11.4621 10.8327 1.0857 1.0859 1.0889 1.0893 1.0927 1.0922 1.0967 1.0962 1.1016 1.1014
irintensity: 0.3614 0.1201 0.3869 1.5286 1.0920 0.1977 0.3467 3.8861 0.6184 0.3893 3.9823 15.6461 2.2133 2.0291 2.5197 1.0103 1.0431 0.7696 5.4904 4.1499 2.1894 2.8229 1.0718 1.4462 17.1340 61.9180 129.5449 20.3224 55.3725 63.3849 54.7268 40.4785 303.9770 1.9032 46.6094 19.5530 3.0009 4.8982 0.9332 3.5723 0.3839 1.7903 0.2061 1.6987 2.1123 2.6198 11.0306 2.9821 3.4024 4.1280 172.7277 23.1276 103.6296 118.8369 3.8306 2.2053 1.6772 3.8553 31.8808 12.2386 2.9168 7.1299 31.4081 26.8923 37.9266 36.0449 187.9465 129.2589 2.3451 1.6776 5.2906 13.4219 1.9484 12.0115 12.0357 12.2068 28.2161 23.9125
temp: 298.150 k
press: 1.00000 atm
elementType: 16 16 8 8 6 6 6 6 6 6 6 6 6 6 6 6 6 6 1 1 1 1 1 1 1 1 1 1
symmnumber: 1
zpe: 521984.3 jmol-1
zpe.correction: 0.198813 hartree
zpe.thermalcorrener: 0.215451 hartree
zpe.thermalcorrenthalpy: 0.216395 hartree
zpe.thermalcorrgfe: 0.150891 hartree
zpe.sumelectzpe: -1484.810879 hartree
zpe.sumelectthermal: -1484.794241 hartree
zpe.sumelectthermalent: -1484.793297 hartree
zpe.sumelectthermalfe: -1484.858801 hartree
dipole: 4.0989 4.8576 -2.0634
dipole: 6.6824
quadrupole: -100.3426 -116.8214 -118.8926
quadrupole: -7.9350 2.1597 3.8001
quadrupole: 11.6763 -4.8025 -6.8738 -7.9350 2.1597 3.8001
hfenergy: -1485.0096921 hartree
pointgroup: C01 [X(C14H10O2S2)]
dipole: -1.6565473 2.0288938 0.2266824 debye
polarizability: 294.9970752|-23.3874856|174.3550807|19.1102233|-20.9108354|142.8998022 unknown
InChI: InChI=1S/C14H10O2S2/c15-13(11-7-3-1-4-8-11)17-18-14(16)12-9-5-2-6-10-12/h1-10H
charge 0 multiplicity 1
28 atoms
S  1.490705 -2.397879 0.488375
S  -0.284564 -1.174446 1.20535
O  4.118528 -2.010623 0.610922
O  -0.668912 -0.903952 -1.525654
C  3.021365 0.129201 0.243784
C  -2.59806 -0.281908 -0.186625
C  4.034403 0.922126 0.853341
C  -3.249842 0.338047 -1.289828
C  2.042209 0.736529 -0.583632
C  -3.278226 -0.401157 1.055265
C  4.043472 2.317358 0.660634
C  -4.557215 0.84159 -1.145461
C  2.07114 2.132515 -0.785938
C  -4.586589 0.106694 1.193729
C  3.060282 2.925131 -0.157901
C  -5.227291 0.729835 0.097015
C  3.078651 -1.335487 0.453356
C  -1.210858 -0.784555 -0.406306
H  4.795164 0.434178 1.471718
H  -2.716196 0.411115 -2.242962
H  1.301632 0.11759 -1.101595
H  -2.799536 -0.908124 1.900531
H  4.814393 2.929827 1.140114
H  -5.055312 1.318634 -1.996156
H  1.326548 2.59992 -1.438851
H  -5.109679 0.009456 2.150686
H  3.071956 4.009871 -0.312203
H  -6.244969 1.120114 0.207692
