program: Gaussian 09
title: 000210725
version: EM64L-G09RevD.01
frameworkgroup: C1[X(C13H13N5S)]
method: RPBEPBE
basis: SDD
operation: Freq
keyword: #p
keyword: freq=noraman
keyword: PBEPBE/SDD
title: #p freq=noraman PBEPBE/SDD
converged: YES YES NO NO
title: Mulliken charges:
elementType: S N N N N N C C C C C C C C C C C C C H H H H H H H H H H H H H
charge: 0.293002 -0.057798 -0.021531 -0.081376 -0.685555 -0.588139 0.119715 -0.826199 0.362839 0.166218 -0.381917 0.144459 -0.367237 -0.365269 -0.441874 -0.414555 0.505801 -0.764550 -0.075317 0.264274 0.294278 0.207339 0.273458 0.218021 0.218910 0.244840 0.240782 0.234853 0.310974 0.309751 0.330767 0.331033
chargesum: 0.00000
title: Mulliken charges with hydrogens summed into heavy atoms:
elementType: S N N N N N C C C C C C C C C C C C C
charge: 0.293002 -0.057798 -0.021531 -0.081376 -0.064830 0.073662 0.119715 -0.267647 0.362839 0.166218 -0.381917 0.144459 -0.159898 -0.091811 -0.223853 -0.195645 0.505801 -0.044074 -0.075317
polarizability: 4.51088371e+02 -6.31080746e+00 1.92235794e+02 5.33841665e+00 -4.49092894e+00 9.37746023e+01
1716.lowfreq: -6.1165 0.0006 0.0008 0.0019 5.1339 8.3126 30.1423 33.2738 64.3855
frequency: 29.9429 33.1009 64.3729 65.8760 86.0319 135.1480 138.8061 194.0418 213.1808 228.9246 240.9278 287.6212 290.1673 326.3712 363.7214 393.8848 400.5835 401.8935 408.4567 418.1326 438.6814 460.5790 487.1291 508.6189 526.8825 545.6838 549.4794 559.1300 580.6101 608.2862 636.7759 678.5388 703.3764 734.5278 773.4816 778.8033 786.5282 810.6435 825.3799 840.8216 847.9670 907.3229 939.5872 947.3834 990.4647 993.0346 993.6255 1013.6725 1027.7012 1039.4099 1064.7781 1129.0012 1158.2407 1177.8648 1192.4777 1236.3817 1269.4847 1287.9474 1310.4596 1320.2292 1340.3189 1371.5552 1383.5118 1387.1863 1431.0971 1439.8648 1446.8666 1449.7519 1467.0102 1474.8209 1518.4015 1521.4280 1546.3494 1571.3202 1605.0182 1631.2520 1645.5874 2992.1723 3019.8004 3071.1460 3119.7088 3121.7471 3124.7882 3130.2172 3150.0166 3165.8690 3559.9053 3560.9018 3700.6049 3720.4835
redmass: 3.6533 4.4813 1.1301 4.5322 4.3483 4.0496 4.8432 5.3787 5.3013 4.2969 5.3985 4.3387 3.2132 4.6035 3.6719 6.4465 1.4690 1.0840 2.3329 4.8299 4.3401 1.2076 5.4565 2.9135 1.1555 5.6993 3.9444 3.3139 3.8975 6.7244 6.8441 7.8214 5.8225 3.4786 5.0113 8.6184 7.7584 1.3803 5.1491 2.0890 3.3785 2.0916 1.4024 4.5594 1.5529 2.4340 2.0419 1.8063 2.0245 1.5951 2.0299 1.2419 1.4506 2.9007 1.1287 1.5099 3.6118 4.2981 1.7042 2.2658 4.2771 3.3092 2.8027 1.8021 1.1660 1.3584 2.0573 1.8920 3.5431 2.2134 3.7904 5.1848 5.2497 6.4192 1.5664 3.2905 1.4111 1.0375 1.0649 1.0948 1.0887 1.0891 1.1006 1.0975 1.0940 1.0943 1.0441 1.0448 1.1040 1.1059
irintensity: 0.2829 0.7414 1.8735 0.6149 2.0233 4.4492 1.5320 4.7993 2.0581 2.6510 2.0622 3.0773 5.6648 7.1791 1.9124 21.2942 199.1885 71.2617 17.4422 12.7525 4.8809 307.6645 11.8890 8.1645 0.3436 3.5578 7.6190 4.9314 12.1955 2.7468 0.7280 11.7408 2.6700 0.9819 8.5639 3.3263 7.8590 15.2867 3.0736 66.4664 28.0135 3.9779 0.6757 7.2259 0.3340 0.9671 4.1185 0.0641 0.4732 7.5482 2.8226 17.4465 9.5202 4.4859 125.2808 43.8136 20.9702 37.1343 11.2003 6.9192 202.5678 33.0526 6.9805 16.4411 12.4457 16.6614 37.0633 31.2163 128.5525 200.4594 121.9025 30.1008 564.9834 43.0015 790.0659 118.7631 415.6069 9.9883 21.4237 13.0413 11.4947 43.7351 16.2551 1.0906 26.2208 6.8932 398.3189 20.0721 22.7363 47.4342
temp: 298.150 k
press: 1.00000 atm
elementType: 16 7 7 7 7 7 6 6 6 6 6 6 6 6 6 6 6 6 6 1 1 1 1 1 1 1 1 1 1 1 1 1
symmnumber: 1
zpe: 640426.1 jmol-1
zpe.correction: 0.243925 hartree
zpe.thermalcorrener: 0.261166 hartree
zpe.thermalcorrenthalpy: 0.262110 hartree
zpe.thermalcorrgfe: 0.198196 hartree
zpe.sumelectzpe: -1173.682463 hartree
zpe.sumelectthermal: -1173.665223 hartree
zpe.sumelectthermalent: -1173.664279 hartree
zpe.sumelectthermalfe: -1173.728193 hartree
dipole: 4.7026 0.5483 0.6185
dipole: 4.7747
quadrupole: -65.2706 -114.4122 -121.7966
quadrupole: 0.3369 -0.6687 -5.3706
quadrupole: 35.2225 -13.9191 -21.3034 0.3369 -0.6687 -5.3706
hfenergy: -1173.9263886 hartree
pointgroup: C01 [X(C13H13N5S1)]
dipole: 1.8439944 -0.2719064 -0.2336639 debye
polarizability: 451.159503|0.506453|190.7886326|-7.627928|-12.0469151|95.1506317 unknown
InChI: InChI=1S/C13H13N5S/c1-7-11-12(18-13(15)16-7)19-6-10(17-11)8-2-4-9(14)5-3-8/h2-5H,6,14-15H2,1H3
charge 0 multiplicity 1
32 atoms
S  -1.306938 2.56214 0.084129
N  -0.258806 -0.433089 -0.094692
N  -3.634394 1.169243 0.236412
N  -3.865971 -1.258577 0.008629
N  6.182379 -0.626728 0.375284
N  -5.721468 0.117452 0.414924
C  0.605341 0.532164 -0.380767
C  0.118682 1.860648 -0.95344
C  2.048103 0.273829 -0.194223
C  -1.648144 -0.22997 -0.12062
C  -2.303302 1.034294 0.045364
C  -2.518284 -1.375084 -0.146123
C  3.064602 1.211521 -0.537697
C  2.471977 -0.98026 0.345417
C  4.427596 0.922182 -0.354382
C  3.824833 -1.281499 0.533169
C  4.835755 -0.331358 0.186589
C  -1.954555 -2.758779 -0.345201
C  -4.364695 0.007299 0.216149
H  0.881646 2.649649 -0.959324
H  -0.265698 1.720747 -1.979663
H  2.805086 2.188535 -0.95881
H  1.695793 -1.704531 0.60981
H  5.184702 1.666948 -0.628564
H  4.117362 -2.252453 0.952147
H  -1.126687 -2.939231 0.362878
H  -2.750023 -3.506781 -0.208056
H  -1.523938 -2.866041 -1.358075
H  6.469545 -1.518048 0.769721
H  6.904014 0.048177 0.138212
H  -6.290097 -0.724576 0.399158
H  -6.128011 1.034984 0.574745
