program: Gaussian 09
title: 000216108
version: EM64L-G09RevD.01
frameworkgroup: C1[X(C8H12ClN5O)]
method: RPBEPBE
basis: SDD
operation: Freq
keyword: #p
keyword: freq=noraman
keyword: PBEPBE/SDD
title: #p freq=noraman PBEPBE/SDD
converged: YES YES NO NO
title: Mulliken charges:
elementType: Cl O N N N N N C C C C C C C C H H H H H H H H H H H H
charge: -0.035089 -0.243508 -0.168454 0.004892 -0.144389 -0.372590 -0.564782 -0.380595 -0.377038 -0.305611 -0.318757 0.544999 -0.406512 -0.405331 0.192123 0.243278 0.222396 0.218395 0.233261 0.220473 0.207641 0.198568 0.222222 0.289801 0.317120 0.304037 0.303451
chargesum: 0.00000
title: Mulliken charges with hydrogens summed into heavy atoms:
elementType: Cl O N N N N N C C C C C C C C
charge: -0.035089 -0.243508 -0.168454 0.004892 -0.144389 -0.055470 0.042706 0.085079 0.074618 0.122503 0.102033 0.544999 -0.116711 -0.405331 0.192123
polarizability: 1.92712489e+02 -1.41872849e+01 1.48467648e+02 -1.15635286e+00 -3.93555497e-02 8.04692106e+01
1716.lowfreq: -9.3532 -0.0017 0.0004 0.0007 1.8541 5.9575 49.9569 57.7996 62.9053
frequency: 49.8653 57.7747 62.8736 111.4050 132.4367 164.8371 203.9551 238.1363 264.0789 269.5328 285.5015 333.0887 338.8601 347.9618 392.1751 456.3635 463.0441 480.0262 502.4651 523.2066 549.1579 601.9485 605.5321 655.5054 663.8868 686.3605 723.3989 798.3491 836.2549 851.6774 876.2136 915.2324 966.4369 1009.6891 1021.3978 1048.3115 1058.5340 1079.8721 1098.2892 1103.4486 1157.6878 1170.5645 1196.0859 1234.7790 1237.7224 1240.0677 1259.9687 1276.7287 1295.7897 1335.7886 1337.1150 1344.7791 1366.4514 1376.9496 1429.8935 1444.6128 1448.8006 1451.5065 1457.7457 1480.1976 1507.8517 1577.9633 1672.2479 2924.7379 2938.5727 2957.2043 2970.5565 3055.8845 3082.4533 3092.8564 3105.3681 3183.0239 3447.1050 3471.7808 3575.7418
redmass: 5.6155 3.3787 6.1059 4.3024 5.6283 4.3819 4.2300 3.6638 3.2999 4.6165 2.9260 4.7192 1.5131 5.2464 1.9470 2.9953 4.3189 3.6878 4.5942 2.8061 2.2105 1.1435 2.6491 7.4076 5.0485 5.1297 4.6787 4.4782 1.7889 3.8772 1.5628 2.3775 4.1915 3.1988 2.3719 2.4972 2.7798 4.1691 3.8671 2.2073 4.7744 3.1578 1.1063 1.8832 1.1917 2.5562 1.4578 1.2996 1.7026 1.6233 1.4881 1.2699 1.4336 1.4294 4.0568 1.0933 1.1444 1.1104 1.1352 3.8513 2.1743 4.9814 1.1717 1.0682 1.0712 1.0662 1.0662 1.0932 1.0971 1.0986 1.0906 1.0910 1.0414 1.0751 1.1053
irintensity: 2.4445 3.5020 2.0401 0.9282 1.5044 5.3838 5.4276 8.5199 2.9174 7.2173 10.3360 12.6972 60.8164 15.6821 1.4633 2.3685 4.0583 12.0975 0.6669 114.2110 156.0567 77.6615 32.2364 5.0553 10.7221 11.6676 0.8734 5.3333 1.7680 25.8612 30.6938 13.1701 10.9727 45.0091 3.7950 15.0137 38.1334 56.8284 17.0366 9.1748 19.8208 170.6198 2.4655 23.6625 1.3125 2.9993 39.9082 2.2494 40.3060 14.1702 11.3662 6.1408 17.3503 26.0271 47.2293 6.1545 21.6580 21.1385 23.8548 62.3213 85.3154 389.3524 59.2349 41.8164 59.8771 55.9809 69.5161 23.1838 33.5189 32.6678 6.7728 2.5904 0.7831 39.9825 4.1294
temp: 298.150 k
press: 1.00000 atm
elementType: 17 8 7 7 7 7 7 6 6 6 6 6 6 6 6 1 1 1 1 1 1 1 1 1 1 1 1
symmnumber: 1
zpe: 549885.4 jmol-1
zpe.correction: 0.209440 hartree
zpe.thermalcorrener: 0.223564 hartree
zpe.thermalcorrenthalpy: 0.224509 hartree
zpe.thermalcorrgfe: 0.167994 hartree
zpe.sumelectzpe: -1119.857123 hartree
zpe.sumelectthermal: -1119.842999 hartree
zpe.sumelectthermalent: -1119.842055 hartree
zpe.sumelectthermalfe: -1119.898570 hartree
dipole: 1.2796 -6.5158 0.3418
dipole: 6.6491
quadrupole: -87.8690 -98.3615 -92.4819
quadrupole: -24.1904 1.1174 3.6232
quadrupole: 5.0351 -5.4574 0.4222 -24.1904 1.1174 3.6232
hfenergy: -1120.0665634 hartree
pointgroup: C01 [X(C8H12Cl1N5O1)]
dipole: 0.188155 -2.533098 -0.6255004 debye
polarizability: 188.5430948|-17.4980775|146.3616416|-8.2381612|20.2276909|86.7446111 unknown
InChI: InChI=1S/C8H12ClN5O/c9-8-6(5-7(11-10)12-13-8)14-1-3-15-4-2-14/h5,11H,1-4,10H2
charge 0 multiplicity 1
27 atoms
Cl -0.451552 2.989047 0.683623
O  -4.010982 -0.846442 0.031738
N  -1.21931 -0.07321 0.112189
N  1.969014 1.86072 0.54589
N  2.940278 0.923246 0.304341
N  3.554199 -1.238536 -0.260149
N  3.32447 -2.567908 -0.626701
C  -2.149347 0.273472 1.224615
C  -1.640749 -1.307044 -0.593119
C  -3.583203 0.401021 0.69121
C  -3.096165 -1.14963 -1.076663
C  0.145857 0.23224 0.188898
C  1.146709 -0.732637 -0.087065
C  0.671176 1.544181 0.485459
C  2.510694 -0.352101 -0.022896
H  -1.839853 1.215634 1.699336
H  -2.113688 -0.535853 1.987354
H  -1.562489 -2.197496 0.071208
H  -0.990137 -1.467627 -1.470765
H  -4.296852 0.557992 1.515878
H  -3.642704 1.2476 -0.02495
H  -3.145065 -0.34008 -1.836553
H  -3.46199 -2.092325 -1.51609
H  0.910675 -1.77395 -0.312822
H  4.499508 -0.851113 -0.166715
H  3.59331 -3.263107 0.074806
H  3.569698 -2.801495 -1.592856
