program: Gaussian 09
title: 000210709
version: EM64L-G09RevD.01
frameworkgroup: C1[X(C22H27NO5)]
method: RPBEPBE
basis: SDD
operation: Freq
keyword: #p
keyword: freq=noraman
keyword: PBEPBE/SDD
title: #p freq=noraman PBEPBE/SDD
converged: YES YES NO NO
title: Mulliken charges:
elementType: O O O O O N C C C C C C C C C C C C C C C C C C C C C C H H H H H H H H H H H H H H H H H H H H H H H H H H H
charge: -0.479958 -0.269861 -0.269813 -0.261615 -0.266636 -0.107497 -0.080369 0.014658 -0.439256 0.427981 0.451232 -0.756265 -0.322597 -0.312388 -0.528183 -0.518356 -0.397758 -0.367937 0.161417 0.216041 -0.328728 -0.357721 0.152125 0.156373 -0.671715 -0.682519 -0.203879 -0.205269 0.200523 0.207823 0.224130 0.241776 0.223493 0.226815 0.202400 0.186070 0.195266 0.187544 0.350466 0.250002 0.307613 0.278053 0.237902 0.250730 0.247986 0.226169 0.211562 0.206257 0.227922 0.208100 0.208736 0.232536 0.241301 0.228994 0.238321
chargesum: 0.00000
title: Mulliken charges with hydrogens summed into heavy atoms:
elementType: O O O O O N C C C C C C C C C C C C C C C C C C C C C C
charge: -0.129492 -0.269861 -0.269813 -0.261615 -0.266636 -0.107497 0.120154 0.014658 -0.007303 0.427981 0.451232 -0.064181 0.065874 0.070422 -0.278181 -0.210743 -0.119704 -0.130035 0.161417 0.216041 -0.077998 -0.109735 0.152125 0.156373 -0.027727 -0.037761 0.269958 0.262046
polarizability: 3.16967070e+02 2.86631250e+01 2.61729501e+02 1.43740154e+01 1.12670845e+01 2.20126852e+02
1716.lowfreq: -10.9252 -7.6455 -0.0003 0.0008 0.0010 2.8746 10.2884 19.5702 30.3457
frequency: 6.1876 19.3549 30.2845 33.6573 38.6457 47.0102 56.5402 69.2562 75.3867 78.4340 86.2124 119.7600 143.2532 159.5109 167.4795 174.4228 192.2020 210.4491 223.0304 226.7474 230.2563 242.2013 264.5193 278.0634 292.8792 309.3092 315.2186 328.4238 346.5706 357.4963 375.1815 378.8277 419.0660 422.5961 433.1574 436.9360 455.6019 475.5749 525.5960 546.0956 558.9857 590.9717 604.6027 642.6793 652.5541 676.2559 679.1745 688.4270 720.3727 729.5178 754.7832 773.2439 779.3807 792.7412 796.0466 801.3929 806.6235 825.2884 836.0248 840.8780 849.5817 870.7615 877.3376 896.3631 908.5347 925.4391 929.4782 938.5007 946.0676 952.9067 971.5868 976.3302 982.7923 994.2544 1051.4507 1054.4990 1062.5530 1069.0466 1071.8994 1072.8962 1077.2641 1084.6402 1091.6997 1117.1904 1123.3093 1126.4784 1128.4880 1130.4359 1139.8379 1154.7753 1172.1727 1191.4611 1201.9885 1231.5430 1242.2589 1258.5120 1261.7783 1265.7478 1281.0158 1285.8020 1290.2505 1307.1684 1313.6532 1359.6204 1361.4406 1361.6878 1362.3464 1368.9796 1374.9405 1380.4235 1387.0106 1388.3521 1389.0776 1434.5452 1438.3853 1461.7419 1462.6833 1468.3452 1470.8296 1472.9217 1474.4169 1475.4912 1479.6571 1485.0491 1485.4152 1486.9783 1487.4290 1492.0458 1608.4319 1609.3925 1626.1942 1628.5208 2847.9702 2854.7218 2869.8991 2983.8738 2984.1615 2985.9920 2987.7345 2993.7310 3002.1531 3023.8789 3028.9928 3036.7916 3075.8865 3077.5553 3084.5101 3090.8324 3091.7986 3093.1563 3101.8585 3102.8021 3146.2723 3157.7676 3173.4118 3179.4155 3181.6596 3201.5272 3562.6121
redmass: 3.4119 5.3923 4.8801 3.9607 4.2433 4.6559 2.6663 2.3617 2.0753 2.6440 2.6415 4.2515 2.7653 2.9050 3.1504 4.2139 5.2568 1.4970 1.2709 3.0097 5.9192 1.9147 4.3355 3.1897 2.0456 2.8102 3.7255 3.6539 1.8474 2.9629 5.3785 2.5520 2.9951 3.1126 2.9182 3.7020 3.4911 2.7779 3.9925 6.3607 6.2133 5.7353 4.8792 5.9534 5.8748 6.9849 8.4617 5.3633 4.5213 3.8782 2.5560 5.9867 6.7455 1.2696 1.5689 1.8950 1.6142 1.9333 4.2801 5.6080 4.0497 2.0256 1.8171 1.8155 1.5397 1.9508 1.7624 1.5746 2.8014 1.3674 3.9915 4.9027 2.9388 2.2569 3.0159 3.4890 2.3982 1.4839 1.4982 1.9016 2.2831 2.1979 2.4250 1.5981 1.2075 1.6912 1.1497 1.6176 1.5475 1.4266 1.9273 2.4581 2.3287 2.8585 3.7990 1.6544 1.3833 1.3329 1.1920 1.2705 1.2837 1.8661 1.3747 1.3181 1.3812 1.3566 1.3236 1.3087 2.4934 1.5554 4.0883 1.2559 1.2339 4.5589 4.4820 1.0528 1.0563 1.1301 1.9374 1.1144 1.6062 1.2011 1.0633 1.0716 1.2738 1.3171 1.0832 1.0710 7.9038 8.0920 8.6298 8.3684 1.0723 1.0716 1.0696 1.0357 1.0359 1.0365 1.0798 1.0611 1.0592 1.0869 1.0868 1.0873 1.0985 1.0978 1.0992 1.1002 1.1003 1.0999 1.1123 1.1099 1.0886 1.0887 1.0915 1.0957 1.0962 1.0926 1.0656
irintensity: 0.0780 0.2662 0.1555 0.9245 0.4522 0.0197 12.5344 2.6832 1.8385 2.5279 8.7529 0.5951 1.6305 1.2756 0.9043 1.2127 0.7096 0.4837 0.2681 1.2721 0.2174 1.6266 7.8784 32.8003 3.4549 3.5319 3.2792 5.4456 112.9565 46.9368 3.0411 5.0810 7.1464 4.6659 0.5657 2.1375 9.3203 3.3023 2.9114 14.1637 4.7601 1.8669 1.2122 11.1712 19.3981 4.7614 2.9079 2.8480 3.0224 7.8056 4.0410 44.7069 11.7744 5.0197 6.6515 5.8718 35.3383 46.1159 34.1637 21.7189 10.2362 18.4244 13.2271 14.3255 23.7665 17.2041 18.3038 17.1969 25.0013 0.2525 40.8134 283.6315 6.6515 11.2058 31.3029 24.9012 33.3906 6.4561 5.1072 18.9130 12.7037 2.1684 26.9627 21.4132 0.8704 3.7420 8.4461 12.0958 7.0995 6.7090 14.4944 8.7045 32.3979 241.6084 90.2282 105.3117 40.1049 2.1713 6.4922 28.5933 10.3297 75.4020 5.6122 3.3631 1.3048 3.0905 7.1750 11.3347 11.4413 9.0237 39.0870 27.4893 23.7483 9.5299 72.4538 8.6720 6.3900 28.1521 205.4876 21.1419 45.2258 15.1301 19.6800 7.3521 28.7822 18.4573 17.0221 11.5271 8.6687 1.3187 1.5335 0.0270 32.2670 83.9007 181.9195 25.8425 30.3054 37.2412 6.7638 155.2557 129.4555 14.5646 41.0455 20.0528 25.4518 98.8876 15.9454 36.2981 50.3140 20.6939 30.3293 34.1041 8.5183 0.7725 4.5900 4.5473 4.1228 4.1570 5.8540
temp: 298.150 k
press: 1.00000 atm
elementType: 8 8 8 8 8 7 6 6 6 6 6 6 6 6 6 6 6 6 6 6 6 6 6 6 6 6 6 6 1 1 1 1 1 1 1 1 1 1 1 1 1 1 1 1 1 1 1 1 1 1 1 1 1 1 1
symmnumber: 1
zpe: 1173682.6 jmol-1
zpe.correction: 0.447032 hartree
zpe.thermalcorrener: 0.474982 hartree
zpe.thermalcorrenthalpy: 0.475926 hartree
zpe.thermalcorrgfe: 0.384927 hartree
zpe.sumelectzpe: -1283.232749 hartree
zpe.sumelectthermal: -1283.204799 hartree
zpe.sumelectthermalent: -1283.203855 hartree
zpe.sumelectthermalfe: -1283.294854 hartree
dipole: 2.7818 0.3667 0.1633
dipole: 2.8107
quadrupole: -149.9057 -163.9792 -164.7494
quadrupole: 5.4688 -1.0883 2.6755
quadrupole: 9.6391 -4.4344 -5.2046 5.4688 -1.0883 2.6755
hfenergy: -1283.679781 hartree
pointgroup: C01 [X(C22H27N1O5)]
dipole: 1.0788635 0.1782697 0.1645005 debye
polarizability: 311.6269346|27.5206221|260.4970402|23.9221435|18.9017616|226.6994474 unknown
InChI: InChI=1S/C22H27NO5/c1-4-23(5-2)12-15(3)22(24,16-6-8-18-20(10-16)27-13-25-18)17-7-9-19-21(11-17)28-14-26-19/h6-11,15,24H,4-5,12-14H2,1-3H3
charge 0 multiplicity 1
55 atoms
O  -0.179534 -0.548102 -2.182523
O  2.49728 3.243667 1.898608
O  -5.127678 -0.941692 -1.317489
O  2.004428 4.96169 0.293702
O  -5.606806 -0.407249 0.972773
N  3.012551 -2.504068 0.100472
C  0.696292 -1.485428 -0.058903
C  -0.113151 -0.304492 -0.716941
C  2.118514 -1.607565 -0.678553
C  0.500302 1.099642 -0.478149
C  -1.57747 -0.309142 -0.228762
C  -0.048191 -2.831962 -0.184012
C  4.023377 -3.188729 -0.752247
C  3.619054 -1.824901 1.277729
C  1.278011 1.404893 0.678546
C  -2.626596 -0.654964 -1.126019
C  0.21079 2.127106 -1.414884
C  -1.868064 0.013812 1.120548
C  1.733965 2.714977 0.824309
C  -3.923558 -0.666325 -0.612499
C  0.679349 3.457802 -1.252159
C  -3.194937 -0.002832 1.627559
C  1.446883 3.723562 -0.116724
C  -4.207738 -0.352805 0.731933
C  3.434441 -4.357552 -1.564738
C  4.05125 -2.803589 2.386142
C  2.812539 4.642564 1.500953
C  -6.184891 -0.9758 -0.274568
H  0.799775 -1.260574 1.021603
H  2.007303 -2.042605 -1.689688
H  2.575365 -0.594116 -0.804511
H  0.629181 -3.641762 0.138015
H  -0.348679 -3.01186 -1.232465
H  -0.956509 -2.859264 0.441341
H  4.809739 -3.588836 -0.087109
H  4.531049 -2.464979 -1.440134
H  2.860186 -1.140563 1.699986
H  4.485016 -1.180538 0.977238
H  0.716752 -0.357243 -2.558824
H  1.521668 0.65496 1.434455
H  -2.40576 -0.894508 -2.166768
H  -0.410288 1.882223 -2.281509
H  -1.057324 0.302185 1.797319
H  0.442495 4.241055 -1.97658
H  -3.415022 0.254919 2.66647
H  2.989166 -5.105026 -0.885308
H  2.645161 -4.023678 -2.262457
H  4.224924 -4.84796 -2.163346
H  3.188592 -3.409953 2.712862
H  4.843683 -3.494872 2.04674
H  4.44581 -2.247632 3.257062
H  3.886291 4.710347 1.244263
H  2.52081 5.321512 2.31755
H  -6.475465 -2.027633 -0.088765
H  -7.02853 -0.346314 -0.597446
