program: Gaussian 09
title: 000210708
version: EM64L-G09RevD.01
frameworkgroup: C1[X(C9H11NO2)]
method: RPBEPBE
basis: SDD
operation: Freq
keyword: #p
keyword: freq=noraman
keyword: PBEPBE/SDD
title: #p freq=noraman PBEPBE/SDD
converged: NO YES NO NO
title: Mulliken charges:
elementType: O O N C C C C C C C C C H H H H H H H H H H H
charge: -0.444511 -0.253481 -0.456912 0.523373 -0.527774 0.226706 -0.584289 -0.386456 0.348658 -0.655821 -0.169660 -0.426529 0.233927 0.228880 0.310616 0.244653 0.309268 0.231413 0.209203 0.235868 0.225665 0.221736 0.355468
chargesum: 0.00000
title: Mulliken charges with hydrogens summed into heavy atoms:
elementType: O O N C C C C C C C C C
charge: -0.089044 -0.253481 -0.146296 0.523373 -0.064966 0.226706 -0.339636 -0.077188 0.348658 0.020662 0.056005 -0.204793
polarizability: 1.73995304e+02 2.72864020e-01 1.13449141e+02 3.42696593e-01 9.50294729e-02 5.50488505e+01
1716.lowfreq: -53.2828 -11.4165 -10.0659 -1.8361 -0.0004 0.0007 0.0010 59.7178 66.6667
frequency: -53.0742 59.7160 66.6665 116.0165 174.7804 227.0437 246.0030 250.4327 280.6219 332.8843 357.9780 424.1884 450.7405 514.3426 550.2498 587.3815 598.5037 656.6822 657.7638 688.4955 753.0544 774.4506 800.9356 862.2372 880.4219 885.8261 941.1003 981.4239 982.0697 1018.0832 1076.1389 1080.2769 1088.8029 1141.4753 1161.7631 1175.1444 1215.2982 1252.9300 1280.4908 1307.6507 1328.0711 1387.9856 1396.0325 1439.2945 1449.6202 1466.1788 1478.2838 1482.9612 1524.0124 1602.2283 1630.0842 1639.8068 2967.6961 3003.0653 3016.5426 3099.3386 3110.2205 3125.0197 3145.0442 3152.9951 3204.3493 3518.4372 3582.1989
redmass: 1.8072 6.9465 3.5086 4.1041 1.2104 4.7670 4.1808 3.6206 6.6149 4.7959 1.1012 4.0286 2.9052 7.1194 2.7254 5.5867 2.5270 1.7305 2.8119 2.0255 6.3422 1.3995 1.3656 1.7083 4.5483 1.4088 3.4472 1.3068 5.9360 1.6842 1.6116 2.5634 1.6159 1.4366 1.9636 1.1363 1.5880 1.1769 2.1453 1.8880 1.7154 5.8554 1.2093 1.8124 1.3161 1.0389 1.0573 2.7975 2.3499 5.9488 4.9718 5.9976 1.0593 1.0364 1.0999 1.1001 1.1004 1.0883 1.0921 1.0952 1.0950 1.0761 1.0661
irintensity: 0.0805 5.5626 3.8893 3.1237 2.0838 1.0191 8.4870 4.2312 3.4775 6.6541 146.2752 9.3217 4.8106 1.4409 0.1323 4.8205 5.1199 52.9369 19.3225 29.2797 9.4004 45.1287 19.6049 47.1510 26.0555 16.8934 31.7070 5.2187 0.1622 2.1950 0.7985 6.4167 22.2399 162.6676 150.8396 26.9688 30.7648 0.1282 64.5366 43.2435 21.9219 144.3910 28.3651 52.0444 16.7771 12.2534 28.4499 160.4468 194.6765 147.7469 161.5098 76.3221 24.7956 31.0446 14.8831 30.8448 30.0583 12.1233 10.1917 13.7281 8.1885 11.1483 38.9186
temp: 298.150 k
press: 1.00000 atm
elementType: 8 8 7 6 6 6 6 6 6 6 6 6 1 1 1 1 1 1 1 1 1 1 1
symmnumber: 1
zpe: 482391.3 jmol-1
zpe.correction: 0.183733 hartree
zpe.thermalcorrener: 0.194676 hartree
zpe.thermalcorrenthalpy: 0.195620 hartree
zpe.thermalcorrgfe: 0.146750 hartree
zpe.sumelectzpe: -553.882083 hartree
zpe.sumelectthermal: -553.871140 hartree
zpe.sumelectthermalent: -553.870196 hartree
zpe.sumelectthermalfe: -553.919067 hartree
dipole: 1.2041 -2.3118 -0.0141
dipole: 2.6066
quadrupole: -55.9271 -70.3134 -74.4933
quadrupole: 13.0664 0.1371 0.0691
quadrupole: 10.9842 -3.4021 -7.5820 13.0664 0.1371 0.0691
hfenergy: -554.0658162 hartree
pointgroup: C01 [X(C9H11N1O2)]
dipole: 0.4814597 -0.9054887 0.0014827 debye
dipolederiv: -0.9966098 0.6074019 -0.0074597 0.7525666 -0.5889966 0.0053836 -0.0086833 0.0046228 -0.4324756 -0.7985655 -0.0277918 -0.0005661 0.555104 -0.8141304 0.0061288 -0.007183 -0.0005078 -0.3231674 -1.9919494 0.0054374 -0.0059174 0.0908565 -0.3027998 0.0018619 -0.0079014 -0.0009498 -0.3258114 1.2228997 0.1211817 0.0043598 0.5530053 0.3193858 0.0008129 0.0001579 -0.0011688 0.1210354 -0.1810368 -0.0976015 0.0017185 -0.2725094 -0.1237831 -0.0091958 -0.0172514 -0.0155236 0.165032 1.94497 -0.0488325 0.0118376 -0.750464 0.9608945 -0.007308 0.0275188 0.0035401 0.1532985 -0.612424 0.1446976 -0.0027051 0.022987 -0.0237031 -0.0010468 -0.0020314 -0.0008762 -0.2467137 -0.3752221 -0.0746979 -0.000292 -0.2843575 -0.2542265 -0.0012665 0.0002489 -0.0000466 -0.2090734 1.1012456 -0.5046488 0.0090986 -0.6736319 0.6111887 -0.0076696 0.0108636 -0.0065579 0.1009294 -0.0020155 0.0509138 0.0032124 0.014187 0.0470602 0.0008537 0.0063639 0.0045415 0.0584169 0.3228 0.0414393 0.0020041 -0.0243932 0.1824971 -0.0022305 0.0030411 -0.0017024 -0.1131199 -0.2483567 0.0155212 0.0000972 0.3321319 -0.3175866 0.0023606 -0.0024748 0.0006448 -0.2475552 -0.0186644 0.0168522 0.0490086 0.0125497 0.0090842 -0.0978929 0.0327139 -0.1203531 -0.0523357 -0.0219937 0.03383 -0.0542772 0.0254798 -0.0134861 0.1031111 -0.0320764 0.1268956 -0.0295019 0.1719712 0.0190313 -0.0012592 -0.0250801 0.0886402 0.0016352 -0.0007439 0.0035161 0.2949187 0.081356 -0.0617491 -0.0001296 -0.0495516 -0.0634514 0.0014663 -0.0004966 0.0014154 0.1853886 0.1377643 0.0681734 -0.0008859 0.0437396 0.0889001 0.0009069 -0.0006931 0.0009843 0.1911027 0.0916816 0.007154 -0.008491 0.0612186 0.0357659 -0.1050189 0.0250994 -0.0967975 -0.0737409 -0.1260544 -0.1088497 -0.0014011 -0.1669998 -0.0233771 -0.0047285 -0.0031756 -0.0058052 0.1055857 0.1013083 0.0108435 0.003384 0.0700229 0.0168879 0.1093707 -0.0223375 0.1014159 -0.0437598 0.0703492 -0.0316654 -0.0001467 -0.048895 -0.1082337 0.0016327 -0.0000161 0.0016524 0.150298 -0.1394526 -0.0470198 -0.0014951 -0.0264301 0.0737253 0.000664 -0.0017991 0.0004946 0.1855645 0.2659988 -0.1396208 0.0003054 -0.2115362 0.1997445 0.0001693 0.0008561 0.0005652 0.3856845 unknown
polarizability: 173.9852014|0.7914393|113.4566387|0.4889097|-0.3150222|55.0514553 unknown
InChI: InChI=1S/C9H11NO2/c1-2-9(12)10-7-4-3-5-8(11)6-7/h3-6,10-11H,2H2,1H3
charge 0 multiplicity 1
23 atoms
O  3.766243 -1.472296 0.024945
O  -2.353921 1.245487 -0.025294
N  -0.97759 -0.658636 -0.008033
C  0.330239 -0.094346 -0.004845
C  -3.410497 -0.985264 -0.027927
C  -2.217523 -0.012063 -0.022101
C  1.420684 -1.00134 0.008086
C  0.567551 1.308089 -0.013742
C  2.739697 -0.508793 0.012002
C  -4.762466 -0.25504 0.042064
C  1.899296 1.770631 -0.009556
C  2.997073 0.882822 0.003207
H  -3.358482 -1.604087 -0.947318
H  -3.3089 -1.686088 0.826025
H  -1.009342 -1.681521 -0.000182
H  1.266364 -2.085945 0.015096
H  -0.278072 1.996187 -0.023258
H  -4.839247 0.341967 0.965945
H  -5.595052 -0.980147 0.019002
H  -4.874819 0.44101 -0.805407
H  2.085187 2.850104 -0.016342
H  4.025531 1.263854 0.006349
H  4.654546 -1.036683 0.026885
