program: Gaussian 09
title: 000210707
version: EM64L-G09RevD.01
frameworkgroup: C1[X(C11H15N3O3)]
method: RPBEPBE
basis: SDD
operation: Freq
keyword: #p
keyword: freq=noraman
keyword: PBEPBE/SDD
title: #p freq=noraman PBEPBE/SDD
converged: YES YES NO NO
title: Mulliken charges:
elementType: O O O N N N C C C C C C C C C C C H H H H H H H H H H H H H H H
charge: -0.266134 -0.263719 -0.483904 -0.172681 -0.633224 -0.653070 0.480806 -0.191038 0.265310 -0.559932 0.194756 -0.437659 -0.480169 -0.368541 -0.316378 -0.315704 0.237625 0.207844 0.304142 0.232038 0.239883 0.196549 0.243667 0.223583 0.228677 0.223817 0.225803 0.359747 0.324884 0.298308 0.313074 0.341644
chargesum: 0.00000
title: Mulliken charges with hydrogens summed into heavy atoms:
elementType: O O O N N N C C C C C C C C C C C
charge: -0.266134 -0.263719 -0.124157 -0.172681 -0.010033 0.001647 0.480806 0.016806 0.265310 -0.255790 0.194756 -0.205622 -0.043737 -0.124874 0.135881 0.133916 0.237625
polarizability: 2.28352300e+02 2.38501519e-01 1.34438794e+02 -8.37770498e+00 -3.28053095e+00 1.04255958e+02
1716.lowfreq: -8.9398 -4.9479 0.0005 0.0007 0.0008 3.7413 19.0143 42.2658 46.5679
frequency: 18.6818 42.1744 46.5615 60.7724 97.8774 133.7626 154.9619 177.7840 215.8686 222.8606 271.5183 308.4490 315.4601 321.4318 364.7332 411.1878 423.5648 439.4911 447.4906 456.8927 466.8788 492.7267 533.8784 541.6552 554.7044 563.9813 621.1316 632.4927 661.7226 686.0536 714.8712 721.5821 749.8738 811.9021 851.7502 871.0122 893.8387 902.9933 916.5317 941.1147 953.9665 998.1244 1021.3562 1028.9342 1033.3811 1036.1136 1050.1590 1087.2240 1096.9146 1138.6258 1173.8663 1182.6473 1189.1484 1204.4313 1239.2555 1246.6632 1258.8352 1270.5973 1306.6162 1320.0924 1350.7132 1352.1562 1390.4538 1400.0175 1419.7499 1431.6430 1444.5856 1456.3181 1459.4756 1491.2407 1585.6767 1607.7982 1624.5180 1624.9975 1678.5511 2906.5695 2924.5300 2969.5801 2991.8577 3000.7616 3094.1951 3096.5528 3124.0356 3161.4864 3178.4044 3289.8539 3538.7653 3556.0125 3685.3574 3698.1059
redmass: 5.1816 4.3980 3.9583 4.2313 3.8824 4.3402 5.6660 4.3593 2.7933 4.1789 4.0535 3.1309 1.1871 3.7045 4.3488 1.3174 3.2414 1.2702 3.6829 3.4605 2.8808 3.9547 1.8880 1.7568 5.5632 3.1153 3.0098 3.2036 1.3806 3.1522 6.2119 4.0554 3.7392 1.4087 3.8760 3.0144 2.6127 3.2605 1.7215 1.3510 2.6303 2.4697 3.1347 1.8156 3.1158 2.0449 4.0598 1.9625 2.9984 1.5591 1.6500 1.6605 1.3847 1.1982 1.6367 1.2930 2.0321 1.2661 1.2936 1.2181 1.3191 1.3076 4.3914 1.8504 3.5202 3.0308 1.1756 1.1120 1.1376 3.1980 7.9617 1.2316 7.0845 1.2998 3.6193 1.0556 1.0837 1.1034 1.0677 1.0610 1.0984 1.1039 1.0887 1.0950 1.0916 1.0634 1.0452 1.0457 1.1027 1.1031
irintensity: 3.7525 0.8474 2.0283 1.6635 7.1799 3.3368 3.7716 2.2473 33.5680 0.4459 6.4087 6.6162 73.1806 6.4909 5.8619 160.2127 31.9351 138.4642 7.4358 2.3405 5.9661 4.5786 95.6904 152.2644 13.9084 25.3561 1.2362 12.7451 72.0250 138.1308 15.4069 6.4329 17.2525 38.8980 21.8786 27.0731 10.2013 8.6754 18.7384 5.3644 25.8817 15.9480 6.3246 9.1380 75.1904 3.9479 60.6554 0.3636 37.7160 21.1414 27.5989 14.8459 2.0349 12.8781 29.9135 1.5069 176.9079 31.4505 61.7438 36.5318 38.6978 14.6598 93.4982 73.4504 63.6449 112.2736 58.2968 0.4412 19.1747 125.0000 24.9686 140.3941 4.0362 101.2036 710.2111 55.5750 31.5415 65.0208 64.4041 55.0334 42.5347 21.1980 14.5036 9.2311 3.1864 199.5733 36.9882 20.0149 23.9230 25.4147
temp: 298.150 k
press: 1.00000 atm
elementType: 8 8 8 7 7 7 6 6 6 6 6 6 6 6 6 6 6 1 1 1 1 1 1 1 1 1 1 1 1 1 1 1
symmnumber: 1
zpe: 672499.5 jmol-1
zpe.correction: 0.256142 hartree
zpe.thermalcorrener: 0.272514 hartree
zpe.thermalcorrenthalpy: 0.273458 hartree
zpe.thermalcorrgfe: 0.210929 hartree
zpe.sumelectzpe: -816.791053 hartree
zpe.sumelectthermal: -816.774681 hartree
zpe.sumelectthermalent: -816.773737 hartree
zpe.sumelectthermalfe: -816.836265 hartree
dipole: 3.2591 2.3447 3.7971
dipole: 5.5261
quadrupole: -49.1418 -102.2722 -98.4170
quadrupole: 9.5686 4.5479 0.7696
quadrupole: 34.1352 -18.9952 -15.1399 9.5686 4.5479 0.7696
hfenergy: -817.0471946 hartree
pointgroup: C01 [X(C11H15N3O3)]
dipole: 1.2743075 1.011946 -1.4418419 debye
polarizability: 228.1156683|-9.712963|111.1704019|1.3293243|13.022558|127.7609818 unknown
InChI: InChI=1S/C11H15N3O3/c12-11(13)14-6-8(15)7-1-2-9-10(5-7)17-4-3-16-9/h1-2,5,8,15H,3-4,6,12-13H2
charge 0 multiplicity 1
32 atoms
O  -2.957239 1.275684 1.318498
O  -4.080167 -0.060236 -1.038666
O  1.661838 -0.52778 1.880546
N  3.677554 -0.106654 0.249108
N  5.900663 0.632768 0.396604
N  4.722873 1.058386 -1.592877
C  -0.051124 -0.732966 0.147337
C  1.410722 -0.94093 0.505476
C  -2.192157 0.384876 0.52304
C  -0.852054 0.160003 0.891075
C  -2.743555 -0.270844 -0.612662
C  -0.615017 -1.412755 -0.964027
C  2.361356 -0.111279 -0.418068
C  -1.951882 -1.17757 -1.345927
C  -4.410523 1.154293 1.082331
C  -4.697736 1.132006 -0.42234
C  4.701442 0.496267 -0.31089
H  1.677123 -2.014591 0.380842
H  -0.434778 0.651531 1.773839
H  -0.012635 -2.133818 -1.529539
H  1.947107 0.916706 -0.519951
H  2.374972 -0.579112 -1.428644
H  -2.400802 -1.685616 -2.205353
H  -4.864177 2.032413 1.569684
H  -4.783874 0.226141 1.557854
H  -5.776808 1.047496 -0.629929
H  -4.292965 2.044611 -0.90249
H  2.654413 -0.355729 1.884317
H  5.89537 0.259972 1.34395
H  6.788559 0.654717 -0.100999
H  5.418638 1.756916 -1.843148
H  3.902459 0.969094 -2.185289
