program: Gaussian 09
title: 000210704
version: EM64L-G09RevD.01
frameworkgroup: C1[X(C6H14O2)]
method: RPBEPBE
basis: SDD
operation: Freq
keyword: #pfreq=noraman
keyword: PBEPBE/SDD
title: #p freq=noraman PBEPBE/SDD
converged: YES YES NO NO
title: Mulliken charges:
elementType: O O C C C C C C H H H H H H H H H H H H H H
charge: -0.438982 -0.437268 -0.055710 -0.393477 -0.434858 -0.341070 -0.322566 -0.695033 0.202333 0.189337 0.194140 0.214084 0.191003 0.194203 0.223337 0.240670 0.182799 0.206681 0.219979 0.209263 0.322175 0.328960
chargesum: 0.00000
title: Mulliken charges with hydrogens summed into heavy atoms:
elementType: O O C C C C C C
charge: -0.116807 -0.108308 0.146623 -0.010000 -0.029771 0.076470 0.100903 -0.059110
polarizability: 8.64726431e+01 -1.00733762e+00 6.80273327e+01 -3.01830693e-01 -7.45843113e-01 6.36607801e+01
1716.lowfreq: -6.8201 -0.0002 0.0006 0.0006 9.5115 13.6453 61.2525 72.4581 87.1912
frequency: 61.1883 72.3829 87.1890 118.9835 123.8707 222.3611 230.6520 294.8095 304.7911 323.1063 348.5267 384.9194 477.0410 562.7164 738.4185 781.8865 822.9220 886.2465 889.3113 951.4638 999.5189 1023.1632 1041.3614 1055.1263 1077.4626 1088.9801 1125.9319 1134.8362 1210.5124 1236.5137 1257.6786 1278.1078 1290.7620 1319.0743 1327.9838 1346.9369 1357.6979 1365.2583 1378.4654 1389.7950 1447.5080 1458.7781 1475.1985 1477.0831 1482.3958 1486.8912 2946.8048 2952.3313 2962.2586 2971.2416 2978.5932 3000.4866 3010.3920 3031.0958 3040.5228 3069.4184 3072.7395 3101.6728 3530.5770 3555.0444
redmass: 3.3139 1.7722 2.7470 2.6705 2.5473 2.2114 1.3946 3.7130 1.4038 1.1761 2.0404 2.6815 2.2202 3.3779 1.1449 1.4695 1.6550 1.5391 1.9639 3.6578 1.5743 3.2425 3.2510 1.3951 2.8489 1.3448 2.2845 1.5462 1.4658 1.3389 1.2832 1.1139 1.2606 1.2365 1.2955 1.3857 1.6723 1.1659 1.2865 1.2168 1.0847 1.0810 1.0509 1.0432 1.0817 1.0823 1.0616 1.0709 1.0602 1.0358 1.0636 1.0913 1.0941 1.0949 1.0990 1.1010 1.0989 1.0945 1.0656 1.0662
irintensity: 2.8629 0.8908 4.5427 1.7449 0.6576 5.9400 2.5293 3.5275 37.7317 232.1446 39.4389 14.1975 3.6791 29.5362 4.6107 5.8737 20.3024 14.9748 19.4878 71.7503 7.1241 14.8760 46.8768 31.1874 9.7300 15.0452 10.2737 32.4606 2.3515 24.6536 4.1562 2.7300 1.1911 5.0074 8.7248 0.4963 8.0179 29.4799 17.8655 9.8069 0.6397 5.8844 3.9761 12.0165 4.3019 16.3413 15.8172 50.1097 34.0799 42.1678 38.1543 12.4053 2.0970 45.8665 32.2055 91.9201 51.3515 23.5353 4.1079 6.0438
temp: 298.150 k
press: 1.00000 atm
elementType: 8 8 6 6 6 6 6 6 1 1 1 1 1 1 1 1 1 1 1 1 1 1
symmnumber: 1
zpe: 508646.1 jmol-1
zpe.correction: 0.193733 hartree
zpe.thermalcorrener: 0.204503 hartree
zpe.thermalcorrenthalpy: 0.205447 hartree
zpe.thermalcorrgfe: 0.157325 hartree
zpe.sumelectzpe: -386.774264 hartree
zpe.sumelectthermal: -386.763493 hartree
zpe.sumelectthermalent: -386.762549 hartree
zpe.sumelectthermalfe: -386.810672 hartree
dipole: -1.7893 -2.4163 0.0924
dipole: 3.0081
quadrupole: -61.8821 -51.7581 -48.0575
quadrupole: -4.0566 3.9621 -3.4422
quadrupole: -7.9829 2.1411 5.8417 -4.0566 3.9621 -3.4422
hfenergy: -386.9679968 hartree
pointgroup: C01 [X(C6H14O2)]
dipole: -0.7063044 0.9409908 -0.1277226 debye
dipolederiv: -0.7527362 0.0089728 -0.0031675 -0.0023855 -0.6793795 0.2288357 -0.0116012 0.254475 -0.1987695 -0.9362336 -0.1514392 0.0808311 -0.19735 -0.3113915 -0.2198601 0.0571162 -0.2088 -0.4271974 0.4710572 0.0070047 0.00472 0.0283019 0.5568808 -0.1654838 0.0164271 -0.1640096 0.3450033 -0.1651162 0.057685 0.006659 0.0082412 0.0026943 -0.0080919 0.0309603 -0.0531351 0.1412355 -0.340931 -0.0809407 0.0182422 0.0489492 -0.017927 -0.0270929 0.0031894 -0.0786261 0.0898718 0.0272974 -0.0019255 0.0079665 0.0677806 0.0707814 -0.0168635 0.0176354 -0.0250413 0.1493247 0.664661 0.1627917 0.0192682 0.0929423 0.3192328 0.1000679 -0.0134632 0.0802714 0.3719313 -0.0692098 0.0362478 0.0190168 0.0064639 0.0745816 -0.0240411 0.0043169 -0.0235136 0.0834456 0.0603913 -0.0003384 -0.0013441 -0.0022044 -0.003265 -0.0386844 -0.0037339 -0.0199661 -0.15446 0.0325045 0.0057198 -0.0242341 -0.0051835 0.0620731 -0.0162531 -0.0138063 -0.052899 -0.1885677 0.047237 -0.0087546 -0.0028593 -0.0330078 -0.1534081 0.0804409 0.0018129 0.1044473 0.0360532 0.0523553 -0.0040418 0.0299511 0.0151174 0.0639657 -0.0239722 0.012967 -0.0497104 -0.1567656 0.0506099 -0.0019655 -0.0009605 0.0175462 -0.1533067 0.0871685 0.017634 0.1163544 0.0286296 0.0224337 0.0053252 0.0375551 -0.0011985 0.0711834 -0.0229587 0.0056277 -0.0490366 -0.1955928 0.07069 0.0144783 0.0028716 -0.0244771 -0.1224946 0.0516467 0.0129196 0.0790934 0.0524641 0.0757028 0.0010939 -0.0220545 0.0171674 -0.0726886 0.0408384 -0.0207648 0.0813506 0.0495024 -0.0304615 -0.0368607 -0.0365764 -0.0164816 0.043596 -0.0344685 -0.0167735 -0.0876726 -0.2278894 0.0749379 -0.0147889 0.0209008 0.0547612 -0.1619004 0.0796589 0.0047032 0.0961275 0.0498094 -0.1706994 -0.0777251 -0.0570143 -0.1104985 0.0353145 -0.0441398 -0.0756249 -0.042127 0.0721636 0.078295 0.0119778 -0.0176197 0.0262389 0.0787834 -0.0120897 0.048551 -0.0300192 -0.1883079 0.3924254 -0.000351 0.0077363 0.0000036 0.2382063 -0.1567908 0.007468 -0.081671 0.0168623 0.3447895 0.0678343 -0.0898885 0.0092727 0.0584679 0.1421334 -0.085561 0.154108 0.2512537 unknown
polarizability: 86.4717611|1.0460464|67.8312423|0.0000808|-1.1855942|63.8577525 unknown
InChI: InChI=1S/C6H14O2/c1-2-3-6(8)4-5-7/h6-8H,2-5H2,1H3
charge 0 multiplicity 1
22 atoms
O  0.040524 -1.572767 0.431284
O  3.802693 0.529789 0.111807
C  0.017114 -0.237103 -0.214882
C  -1.273263 0.531854 0.142756
C  1.300574 0.552759 0.125986
C  -2.560135 -0.185292 -0.321428
C  2.582584 -0.170103 -0.326644
C  -3.844174 0.543663 0.128465
H  0.007538 -0.492444 -1.292425
H  -1.30619 0.688289 1.243292
H  -1.227069 1.542239 -0.313466
H  1.355047 0.724568 1.220713
H  1.245086 1.55274 -0.353867
H  -2.548203 -0.268995 -1.427225
H  -2.552347 -1.221083 0.067673
H  2.645094 -1.16455 0.141202
H  2.578604 -0.306049 -1.430294
H  -3.879836 1.576173 -0.26853
H  -4.749562 0.015957 -0.222911
H  -3.899073 0.607818 1.231878
H  0.023714 -1.437615 1.414777
H  3.822681 1.427752 -0.306761
