program: Gaussian 09
title: 000210703
version: EM64L-G09RevD.01
frameworkgroup: C1[X(C16H24N2O3)]
method: RPBEPBE
basis: SDD
operation: Freq
keyword: #p
keyword: freq=noraman
keyword: PBEPBE/SDD
title: #p freq=noraman PBEPBE/SDD
converged: YES YES NO NO
title: Mulliken charges:
elementType: O O O N N C C C C C C C C C C C C C C C C H H H H H H H H H H H H H H H H H H H H H H H H
charge: -0.246373 -0.278598 -0.263883 -0.079287 -0.061760 -0.337252 -0.353583 -0.389519 -0.382914 -0.355859 -0.500831 -0.614763 0.119564 0.152534 0.241182 -0.319995 -0.506382 -0.387743 0.339584 -0.534724 -0.534588 0.183722 0.199477 0.206338 0.185443 0.182488 0.201976 0.202950 0.184861 0.189328 0.233126 0.245012 0.256828 0.220520 0.184844 0.221860 0.283822 0.262199 0.245990 0.227115 0.229093 0.247762 0.226888 0.246839 0.226709
chargesum: 0.00000
title: Mulliken charges with hydrogens summed into heavy atoms:
elementType: O O O N N C C C C C C C C C C C C C C C C
charge: -0.246373 -0.278598 -0.263883 -0.079287 -0.061760 0.045947 0.038198 -0.005055 0.004897 0.066595 0.001009 0.012461 0.119564 0.152534 0.241182 -0.036174 -0.244183 -0.141753 0.339584 0.169245 0.165848
polarizability: 2.99411353e+02 -6.31531693e-01 2.01380308e+02 -3.64084096e+00 -4.88961371e-01 1.24075228e+02
1716.lowfreq: -25.4897 -2.8915 -0.0009 -0.0007 0.0005 5.7191 11.9864 25.9927 36.0502
frequency: -10.8457 24.5574 36.0264 52.0914 73.4297 92.4624 98.5576 110.8407 134.8437 151.0677 165.8124 187.1213 202.4933 218.2224 220.6733 229.2313 239.0035 264.2249 274.8240 302.2099 304.2125 319.7218 342.9170 361.6938 387.6260 410.7808 436.5774 451.0072 453.7674 491.9081 526.3620 555.4452 567.0267 604.5881 618.6505 630.4472 701.7190 723.0702 735.7305 757.0238 786.9758 810.7759 820.4190 847.5461 850.5169 879.9605 920.5583 980.1178 983.4176 986.9461 1007.8312 1014.9095 1023.1592 1033.6128 1050.9717 1063.3800 1081.5591 1087.8445 1111.1976 1112.6318 1118.0158 1122.1118 1136.9329 1142.6830 1143.6702 1149.5499 1156.3610 1172.6713 1181.3377 1191.3235 1205.3267 1232.1041 1241.6974 1267.6433 1271.9086 1278.4098 1291.7151 1303.2488 1313.5938 1336.1688 1350.7668 1368.4986 1371.4505 1376.1509 1394.8627 1412.4523 1419.1953 1428.6910 1433.8895 1447.7617 1452.0454 1452.6550 1459.1743 1461.1282 1467.2926 1468.7370 1469.0986 1469.7982 1472.9828 1474.2553 1481.2837 1489.0745 1549.6992 1570.3828 1621.4327 2840.6063 2843.9496 2855.1766 2858.9912 2865.8570 2876.9584 2967.9642 2968.6143 2993.3178 3014.0679 3020.9409 3025.1603 3030.6888 3034.1753 3039.6762 3054.3426 3060.2481 3060.5630 3072.7311 3128.2966 3130.3452 3147.0321 3174.1360 3182.7014
redmass: 3.8001 4.3239 4.4767 3.7596 4.0769 3.1926 3.3356 3.3769 3.0190 3.0880 3.6988 4.2272 1.8108 1.5811 1.7889 1.3209 2.6015 1.6715 1.5805 3.3103 4.1927 2.2907 2.8925 4.1258 2.5464 3.2526 4.1960 3.3297 3.6870 2.9013 5.9577 2.6359 4.5739 2.5476 3.6851 3.9375 6.0607 2.3982 4.6166 3.1727 1.4919 2.8980 1.6385 1.5540 1.7913 6.3201 2.1055 8.3863 3.2957 1.4982 2.6327 2.9757 2.4658 2.1574 1.6219 2.0047 1.6495 2.3513 1.2599 1.2582 1.7015 1.8232 2.3495 2.2092 1.6145 2.8933 1.3648 1.8502 1.4143 1.0939 1.6739 1.9443 3.2042 1.3602 1.7278 1.6299 1.3357 1.3507 1.7069 1.3123 1.4730 1.5168 1.4232 5.1829 1.5137 1.1422 2.5340 1.1729 1.2082 1.4812 1.0833 1.0808 1.0813 1.0709 1.0523 1.2194 1.0511 1.0942 1.0647 1.1043 1.0538 2.0139 7.5213 7.4174 6.9047 1.0666 1.0657 1.0691 1.0688 1.0687 1.0684 1.0322 1.0324 1.0618 1.0720 1.0885 1.0911 1.0879 1.0912 1.0876 1.0928 1.1044 1.1044 1.1009 1.1003 1.1002 1.0886 1.0944 1.0907
irintensity: 0.0454 1.6255 0.3426 0.3570 0.3332 3.8996 10.8636 1.2221 0.6944 3.4073 0.8991 8.0171 2.3352 0.8659 1.5846 0.5872 0.7522 1.1858 0.5714 2.2566 0.5145 11.3060 5.3496 0.1130 4.6491 3.7234 13.1588 3.4138 8.5970 4.4718 3.9162 3.6635 25.5929 0.2058 4.6774 5.1194 2.3685 1.5597 2.6534 10.9636 8.9491 29.1309 8.6259 0.3455 53.1718 7.9831 14.7970 51.0128 52.9156 12.4850 9.6822 62.1249 14.7808 3.0497 4.6192 10.4888 2.5200 33.4509 0.3082 0.3484 101.7193 75.1276 45.6848 17.4424 47.6708 26.8680 4.4278 103.0867 3.3882 0.0923 39.0762 9.0978 292.7319 12.5250 28.2871 21.8371 28.5519 15.8170 87.9773 30.3715 44.4679 27.9611 11.5298 47.9757 19.6114 25.1459 45.0487 1.1387 3.3853 14.5323 0.4543 1.5529 23.4441 9.6503 16.1918 62.1128 15.1304 45.3084 37.8057 3.4421 8.3928 13.5300 80.1374 236.0743 304.3860 64.0871 77.2850 34.1606 55.0852 64.0422 310.9773 59.2562 67.1117 15.4867 49.5697 40.6531 69.8456 51.1877 11.1142 25.7139 29.7433 21.1981 59.1240 37.0574 18.2064 22.6797 0.6122 14.8864 2.8743
temp: 298.150 k
press: 1.00000 atm
elementType: 8 8 8 7 7 6 6 6 6 6 6 6 6 6 6 6 6 6 6 6 6 1 1 1 1 1 1 1 1 1 1 1 1 1 1 1 1 1 1 1 1 1 1 1 1
symmnumber: 1
zpe: 991573.1 jmol-1
zpe.correction: 0.377670 hartree
zpe.thermalcorrener: 0.398530 hartree
zpe.thermalcorrenthalpy: 0.399475 hartree
zpe.thermalcorrgfe: 0.327813 hartree
zpe.sumelectzpe: -957.593193 hartree
zpe.sumelectthermal: -957.572333 hartree
zpe.sumelectthermalent: -957.571389 hartree
zpe.sumelectthermalfe: -957.643050 hartree
dipole: -3.4369 3.7772 -0.2613
dipole: 5.1135
quadrupole: -93.6794 -123.0437 -129.5039
quadrupole: 4.7588 -3.3678 1.1335
quadrupole: 21.7296 -7.6347 -14.0949 4.7588 -3.3678 1.1335
hfenergy: -957.9708637 hartree
pointgroup: C01 [X(C16H24N2O3)]
dipole: -1.4469151 0.1680414 -1.3876388 debye
polarizability: 295.9908734|23.5139918|136.0049987|0.0539125|-24.6031391|192.8710165 unknown
InChI: InChI=1S/C16H24N2O3/c1-17-8-10-18(11-9-17)7-6-15(19)14-5-4-13(20-2)12-16(14)21-3/h4-5,12H,6-11H2,1-3H3
charge 0 multiplicity 1
45 atoms
O  -0.288419 -1.172737 2.586478
O  -1.248681 -0.138479 -1.43064
O  -5.893895 -1.076428 -0.528233
N  3.211163 -0.132465 0.446856
N  5.73126 1.047364 -0.397371
C  3.265308 1.214315 -0.175397
C  4.47796 -0.400913 1.175379
C  4.470467 1.32436 -1.124257
C  5.681673 -0.296492 0.22578
C  2.030185 -0.324225 1.328007
C  0.714957 -0.360168 0.532309
C  6.923978 1.234975 -1.242825
C  -0.469693 -0.818616 1.377133
C  -1.861302 -0.860427 0.805549
C  -2.253322 -0.536155 -0.538652
C  -2.892518 -1.266794 1.694253
C  -3.605012 -0.621969 -0.936379
C  -4.242659 -1.358978 1.320845
C  -4.595084 -1.030873 -0.012999
C  -1.628932 0.178407 -2.811936
C  -6.972086 -1.498024 0.374004
H  3.342498 2.017683 0.602009
H  2.338912 1.385288 -0.752837
H  4.429944 -1.421289 1.599635
H  4.625716 0.319569 2.01958
H  4.322967 0.609638 -1.975126
H  4.519423 2.348605 -1.540663
H  6.616488 -0.457536 0.795554
H  5.602472 -1.104314 -0.547017
H  1.968331 0.461662 2.122401
H  2.149339 -1.286932 1.856352
H  0.465284 0.620981 0.086801
H  0.824956 -1.038605 -0.336598
H  6.945901 2.269185 -1.632068
H  6.964968 0.535916 -2.117948
H  7.836311 1.077845 -0.639221
H  -2.57777 -1.513484 2.714013
H  -3.928782 -0.381569 -1.951431
H  -4.991413 -1.677475 2.05059
H  -2.331581 1.032608 -2.848492
H  -2.078483 -0.699037 -3.314253
H  -0.685843 0.449256 -3.308592
H  -6.805855 -2.528746 0.740729
H  -7.885282 -1.462464 -0.237398
H  -7.068448 -0.806463 1.232475
