program: Gaussian 09
title: 000210702
version: EM64L-G09RevD.01
frameworkgroup: C1[X(C10H10ClN3O2)]
method: RPBEPBE
basis: SDD
operation: Freq
keyword: #p
keyword: freq=noraman
keyword: PBEPBE/SDD
title: #p freq=noraman PBEPBE/SDD
converged: YES YES NO NO
title: Mulliken charges:
elementType: Cl O O N N N C C C C C C C C C C H H H H H H H H H H
charge: -0.067531 -0.273745 -0.273115 -0.097487 -0.149807 -0.600191 -0.090605 0.211104 -0.693081 0.372444 -0.310545 -0.367156 -0.216780 -0.183939 0.200180 -0.118717 0.230996 0.254696 0.221666 0.231354 0.251592 0.258818 0.251047 0.256929 0.348135 0.353740
chargesum: 0.00000
title: Mulliken charges with hydrogens summed into heavy atoms:
elementType: Cl O O N N N C C C C C C C C C C
charge: -0.067531 -0.273745 -0.273115 -0.097487 -0.149807 0.101683 0.140391 0.211104 0.014635 0.372444 -0.058954 -0.108339 0.034268 0.072990 0.200180 -0.118717
polarizability: 1.96285233e+02 -1.46471560e+01 1.44217288e+02 -9.00702518e-01 -1.29429121e+01 9.41085049e+01
1716.lowfreq: -4.5585 -2.5778 -0.0020 0.0006 0.0022 5.8695 20.9380 26.0594 55.1525
frequency: 20.8417 26.0099 55.1490 91.9229 119.2928 141.5666 165.1873 199.9030 224.4510 262.9362 268.3703 303.0400 322.1854 337.7714 362.7796 414.7442 416.7826 456.5884 465.7246 495.9268 498.1284 618.5630 625.5645 637.8194 673.7412 694.3563 695.2076 740.4922 762.3372 797.6243 821.9691 864.6812 873.0287 884.9646 924.1348 938.3947 950.9827 990.7247 1006.2907 1030.8849 1064.0788 1073.0231 1097.5577 1111.6927 1154.6190 1175.8951 1207.2980 1289.5439 1296.9106 1313.3934 1359.4142 1369.5313 1395.7513 1404.4834 1457.6770 1469.2010 1471.4280 1505.5708 1575.4319 1584.9934 1600.9878 1642.9750 3000.4422 3013.2558 3113.5745 3128.7211 3159.6965 3161.0306 3178.9516 3184.8364 3575.8952 3722.4586
redmass: 9.2694 5.3642 5.0132 6.7195 5.1617 5.2270 3.8580 1.1746 6.8855 3.8004 4.1655 3.4489 4.4584 1.8608 2.6431 3.2745 4.8310 1.5226 2.7003 2.8232 4.6155 6.7660 5.7203 6.3155 7.5684 3.5459 8.2306 5.0229 4.5172 1.3160 1.5156 9.4379 8.8568 5.5003 1.3422 3.6851 1.3416 4.0148 2.1980 2.9693 1.8074 2.5045 2.9228 1.3255 2.3486 1.3015 3.2103 1.3105 1.8857 1.2092 2.6463 5.9487 1.2250 3.7257 1.0705 1.0813 2.2556 6.9746 1.5401 6.6696 6.4555 3.0706 1.0833 1.0362 1.1003 1.1013 1.0884 1.0892 1.0972 1.0958 1.0450 1.1058
irintensity: 2.5046 6.3142 1.4365 0.4408 1.1755 1.5047 7.6220 0.6529 0.1886 0.1386 1.5284 5.1989 9.2766 44.9316 19.3871 1.2927 5.0986 199.3695 75.7253 16.2580 23.5516 3.8471 18.4865 17.3459 11.7051 0.9407 13.5083 13.4876 11.2708 22.4043 68.7913 4.7903 22.8254 82.5978 0.1906 27.9524 0.3704 41.8830 34.9025 24.2201 92.1771 21.3633 12.8325 14.2986 2.1768 77.8422 190.3650 2.6510 4.3314 1.4735 64.5694 13.8670 23.1439 0.2490 10.5917 8.3525 204.3910 6.0457 19.7672 13.5082 19.7609 493.7597 14.8807 13.3518 19.8615 12.6795 3.2871 3.7568 4.7282 3.7478 131.5120 68.3476
temp: 298.150 k
press: 1.00000 atm
elementType: 17 8 8 7 7 7 6 6 6 6 6 6 6 6 6 6 1 1 1 1 1 1 1 1 1 1
symmnumber: 1
zpe: 496697.8 jmol-1
zpe.correction: 0.189182 hartree
zpe.thermalcorrener: 0.204258 hartree
zpe.thermalcorrenthalpy: 0.205202 hartree
zpe.thermalcorrgfe: 0.144910 hartree
zpe.sumelectzpe: -1160.613982 hartree
zpe.sumelectthermal: -1160.598907 hartree
zpe.sumelectthermalent: -1160.597962 hartree
zpe.sumelectthermalfe: -1160.658255 hartree
dipole: 0.1548 2.6272 -2.2078
dipole: 3.4352
quadrupole: -125.4514 -79.9812 -97.7629
quadrupole: 11.9521 -9.3494 -0.1561
quadrupole: -24.3862 21.0840 3.3022 11.9521 -9.3494 -0.1561
hfenergy: -1160.8031646 hartree
pointgroup: C01 [X(C10H10Cl1N3O2)]
dipole: -0.2764167 1.1491198 0.6555055 debye
dipolederiv: -0.6234108 -0.3421901 0.0635016 -0.406176 -0.3775972 0.013846 0.0654081 0.0085096 -0.1024214 -1.729878 -0.461203 0.15201 -0.7185405 -0.6743417 0.2210653 0.356051 0.1563289 -0.3406771 -0.6624277 0.1303227 -0.2573847 -0.059855 -0.7133929 0.0391962 -0.304073 0.1389931 -0.2011311 -0.1016327 -0.1119398 0.0747334 -0.2902562 0.0377988 -0.1134785 0.1071283 -0.0888049 -0.1319285 -0.1721031 -0.3340696 0.0892149 0.532027 -0.8371087 0.2295175 -0.0516822 -0.0896284 -0.2221558 -0.3514744 0.1725584 0.1698884 0.4678474 -1.3883566 0.1875425 0.1260591 0.1119311 -0.6319703 1.2271698 0.0312483 -0.068411 -0.2169667 0.3587991 -0.136411 -0.3486776 -0.2532017 0.5076898 0.1244427 0.1504177 0.0428741 0.1091558 0.4771169 -0.0362146 0.0382927 0.157 -0.0687791 -0.0719365 -0.0273554 0.0024592 -0.0361353 -0.0590467 0.0396613 0.0320156 0.0594485 0.0364277 1.2076944 0.5488883 -0.1077094 1.0615203 0.4978827 -0.1586952 -0.0184075 -0.0387151 0.0618125 -0.1681715 -0.0170628 -0.0015026 -0.3108123 -0.1871709 0.1212022 -0.1737796 -0.0194538 -0.1369058 -0.3279573 -0.1301991 -0.0417303 -0.0523171 -0.0383963 0.0834883 0.0625069 0.1592453 -0.0948686 -0.0892137 -0.1026809 -0.0768516 -0.0203203 -0.0598852 0.0503796 -0.0235122 0.0842432 -0.0224293 -0.1090815 -0.0527072 -0.0308822 -0.0789261 -0.0389614 0.0844821 -0.0366232 0.0624948 -0.0253701 0.3995839 0.0324975 0.0825789 -0.5353056 1.746553 -0.2793946 0.1509796 -0.1641002 0.3193975 0.7197748 0.5729738 -0.0821779 0.6037878 0.3879498 -0.0247218 -0.0921082 -0.0321309 -0.0618265 -0.0599012 -0.0073174 -0.0729083 0.0320027 -0.0002133 -0.1062763 0.0183885 -0.0194673 -0.0535138 0.1067704 -0.0329586 -0.0379275 -0.031407 0.0745658 -0.027309 -0.0562967 -0.0843421 -0.0256089 -0.0348307 -0.0244116 0.1190575 -0.0091998 0.0695622 -0.0225115 0.1211203 -0.0026576 0.0126611 -0.0209529 0.1127056 -0.0842469 0.0911074 0.0104043 0.0583483 -0.0744099 0.0388011 0.073999 0.0099552 -0.0009084 0.1006269 0.0206594 0.0907045 -0.0333026 0.1298442 -0.0289827 0.0948912 0.112707 -0.037891 0.0139838 -0.0286632 0.0010489 -0.0862879 0.0156994 -0.0755259 0.1063284 0.1019587 -0.0166662 0.0191003 -0.0310866 -0.0000904 -0.088862 0.0174825 -0.0842694 0.0960365 0.0102297 0.0131307 0.0920121 0.0011529 0.1091445 -0.0374332 0.0905454 -0.0423098 0.0861086 0.2088035 0.0320185 -0.1018513 -0.0308897 0.2759242 0.0220056 -0.0930162 0.063597 0.3532319 0.2938817 -0.0972002 -0.0584574 -0.0624034 0.2371063 0.0001634 -0.0589352 -0.017003 0.3710021 unknown
polarizability: 187.5851273|23.0138704|155.3063774|-9.1821644|-0.1519994|91.7195209 unknown
InChI: InChI=1S/C10H10ClN3O2/c1-6(9-13-14-10(12)16-9)15-8-4-2-7(11)3-5-8/h2-6H,12H2,1H3
charge 0 multiplicity 1
26 atoms
Cl 4.892576 2.197683 -0.287581
O  0.223109 -1.609655 0.073315
O  -1.864267 0.777204 0.351113
N  -3.159855 -1.048333 -0.113123
N  -3.853111 0.119771 -0.598074
N  -3.244344 2.483314 -0.560236
C  -0.912363 -1.468706 1.033877
C  -2.015935 -0.654869 0.427075
C  -1.373829 -2.896521 1.342621
C  1.25224 -0.649668 0.046891
C  1.270482 0.559931 0.784429
C  2.339398 -0.982045 -0.801401
C  2.386383 1.423484 0.682621
C  3.446571 -0.118507 -0.908661
C  -3.050594 1.157667 -0.307435
C  3.45737 1.075205 -0.157907
H  -0.541106 -0.974603 1.953231
H  -1.737111 -3.387696 0.426599
H  -2.196585 -2.884767 2.077403
H  -0.527506 -3.471473 1.75225
H  0.428214 0.862714 1.410612
H  2.301073 -1.919279 -1.364015
H  2.409717 2.358388 1.249968
H  4.286235 -0.373193 -1.561445
H  -2.530047 3.167684 -0.331331
H  -4.093418 2.766366 -1.041094
