program: Gaussian 09
title: 000210701
version: EM64L-G09RevD.01
frameworkgroup: C1[X(C9H8ClN3O2)]
method: RPBEPBE
basis: SDD
operation: Freq
keyword: #p
keyword: freq=noraman
keyword: PBEPBE/SDD
title: #p freq=noraman PBEPBE/SDD
converged: YES YES NO NO
title: Mulliken charges:
elementType: Cl O O N N N C C C C C C C C C H H H H H H H H
charge: -0.063331 -0.259903 -0.249066 -0.100808 -0.151185 -0.601011 -0.372372 0.364054 0.215517 -0.317171 -0.352367 -0.209213 -0.185282 -0.116892 0.197939 0.228343 0.248150 0.251617 0.258640 0.253778 0.257368 0.348719 0.354475
chargesum: 0.00000
title: Mulliken charges with hydrogens summed into heavy atoms:
elementType: Cl O O N N N C C C C C C C C C
charge: -0.063331 -0.259903 -0.249066 -0.100808 -0.151185 0.102183 0.104121 0.364054 0.215517 -0.065554 -0.093728 0.044565 0.072086 -0.116892 0.197939
polarizability: 2.22517323e+02 6.97484422e+00 1.09452738e+02 4.51089359e+00 4.98224931e+00 7.64200868e+01
1716.lowfreq: -5.2110 -3.3169 -0.0013 -0.0010 -0.0006 3.0401 22.6884 37.0411 51.2752
frequency: 22.5819 36.9951 51.2715 90.5030 132.6525 142.9189 207.9606 255.2482 276.0912 301.6874 316.7975 349.3564 398.8842 411.0918 416.7020 447.6168 459.7236 498.7298 609.6958 623.6844 631.0358 678.6905 695.4519 697.6377 759.8452 800.5071 812.3957 824.3678 860.1180 874.9935 925.3588 928.6980 944.9354 953.8753 990.9531 1002.5772 1038.6778 1072.2337 1110.7933 1161.0539 1177.4870 1213.3669 1226.3046 1291.2805 1343.6481 1360.1359 1378.7801 1404.6708 1452.0226 1474.9091 1532.2130 1575.7128 1584.7993 1604.5032 1644.1281 2978.3294 3052.6149 3156.5691 3160.4010 3175.3977 3180.5777 3575.9676 3722.8005
redmass: 8.8831 4.9321 8.1161 5.9445 8.8052 7.0820 6.9880 6.2584 2.8222 2.4193 6.7277 1.6638 3.2147 5.4612 3.1333 2.9987 1.4739 2.7165 8.7295 7.3772 6.6068 9.3116 6.1330 4.0176 6.2590 1.3407 5.7593 1.5287 6.1323 9.8675 2.0010 2.1691 6.0780 1.3512 4.0007 1.9904 3.5387 2.5967 1.3080 2.2346 1.2555 3.7719 1.3400 1.2674 2.1070 2.6377 2.8888 3.6844 1.1540 2.1574 8.2732 1.4988 7.1716 6.5592 3.2120 1.0586 1.1034 1.0878 1.0885 1.0966 1.0978 1.0450 1.1058
irintensity: 1.7504 4.9329 0.9475 2.7503 2.4320 4.0835 2.5275 1.2363 12.9910 12.7367 0.4938 48.0720 6.8993 9.4239 0.3651 56.6388 231.3170 23.5300 12.9772 4.3078 1.2541 18.7110 18.9482 6.1978 28.0358 13.1048 17.2467 70.3643 18.1018 11.0728 34.2983 59.5842 82.6482 0.4614 36.1902 1.9953 38.9528 43.3231 13.2350 41.2151 48.4121 276.5255 0.1441 2.6858 21.4395 17.8803 54.0770 0.4809 61.7677 176.8966 7.0774 24.7850 20.8844 26.6375 547.4667 26.5479 11.0695 11.0897 1.6097 7.9873 1.0698 155.4631 72.2730
temp: 298.150 k
press: 1.00000 atm
elementType: 17 8 8 7 7 7 6 6 6 6 6 6 6 6 6 1 1 1 1 1 1 1 1
symmnumber: 1
zpe: 425158.9 jmol-1
zpe.correction: 0.161934 hartree
zpe.thermalcorrener: 0.175466 hartree
zpe.thermalcorrenthalpy: 0.176410 hartree
zpe.thermalcorrgfe: 0.119477 hartree
zpe.sumelectzpe: -1121.384737 hartree
zpe.sumelectthermal: -1121.371205 hartree
zpe.sumelectthermalent: -1121.370261 hartree
zpe.sumelectthermalfe: -1121.427195 hartree
dipole: 2.7886 2.1090 -3.5996
dipole: 5.0181
quadrupole: -91.4848 -85.2906 -96.7037
quadrupole: 18.6992 -16.6027 4.7081
quadrupole: -0.3251 5.8691 -5.5440 18.6992 -16.6027 4.7081
hfenergy: -1121.5466714 hartree
pointgroup: C01 [X(C9H8Cl1N3O2)]
dipole: -1.0911232 -0.548609 -1.5512184 debye
dipolederiv: -0.9015958 0.0078015 0.0489477 -0.0034971 -0.1255142 0.0144924 0.0605759 0.0136422 -0.0775893 -2.1809599 0.178212 0.0293333 0.3246481 -0.2942451 0.0060907 0.0191863 0.0060719 -0.2676775 -0.7454483 -0.2089466 -0.0180746 -0.1225092 -0.2796862 -0.2923285 0.2223701 -0.2342318 -0.49111 0.299632 0.1195879 0.0155778 0.2121741 -0.1469043 0.0058441 0.0135497 0.0161717 -0.1959952 -0.5146788 0.0096256 0.0484417 -0.582321 -0.4510411 -0.1383012 -0.7019729 -0.297247 -0.4547211 -0.9312659 -0.3216194 -0.4559317 -0.5042182 -0.8920922 -0.1146996 -0.672479 -0.1437739 -0.6876788 1.2182561 -0.1185354 0.0008 -0.6494667 0.4366726 -0.0545528 0.1900877 -0.0542361 0.3389559 1.8273391 -0.1076481 -0.0502124 0.1882761 0.0125543 0.0230318 -0.1757944 0.0272616 0.1041642 0.0643614 0.0378921 0.0226334 0.1069476 0.1893381 0.2610115 0.2303623 0.2834396 0.3858644 -0.3340429 0.060946 -0.0165 -0.2769525 -0.017959 -0.0316081 0.0770787 -0.0430464 -0.194257 -0.3778926 -0.0039373 0.003978 0.1896297 0.0203392 -0.0624406 -0.0347804 -0.0476002 -0.1522783 -0.1605153 -0.0632565 0.0215967 0.0491953 0.0625969 -0.0417863 -0.0084919 -0.0341767 -0.0860784 -0.1326138 0.0231703 -0.0047828 0.0089297 0.0692774 -0.0413178 0.0010032 -0.0451321 -0.0876145 1.1802147 0.014794 -0.0878638 -0.0216809 -0.0420516 -0.0113659 -0.0832603 -0.0148194 -0.0851857 1.0433161 0.4354421 0.2993796 0.8005204 0.765293 0.4920591 0.7805223 0.5475556 0.8201599 -0.0589337 -0.0287227 0.0463577 0.1522768 0.0276533 0.0387333 -0.0103124 0.0916521 -0.0807005 0.0196456 -0.0287895 -0.0238582 0.103283 -0.0407518 -0.0513025 -0.0558405 -0.0810549 0.0218609 0.0187563 0.0916638 -0.0100476 0.1193274 -0.008348 0.038477 -0.0170041 0.0361065 0.1610116 0.0531385 -0.0661666 0.0256141 -0.0642205 0.0139569 0.0438895 0.0240947 0.0429324 0.1579195 0.0476215 -0.0592214 0.0224881 -0.0626506 0.0051635 0.0437663 0.0232001 0.0439041 0.1515303 0.0417411 0.0726469 -0.0111768 0.0654474 0.0074539 0.0355008 -0.0087359 0.0348228 0.1563568 0.1840629 -0.0515182 0.0320316 -0.0126724 0.3565673 -0.0664728 0.1102513 -0.0419028 0.3202771 0.3398617 0.0065794 0.061268 -0.0204665 0.331727 -0.0967204 0.0163895 -0.1063394 0.2427858 unknown
polarizability: 222.5331016|7.7340687|110.1297286|-2.5674514|1.5081767|75.7273183 unknown
InChI: InChI=1S/C9H8ClN3O2/c10-6-1-3-7(4-2-6)14-5-8-12-13-9(11)15-8/h1-4H,5,11H2
charge 0 multiplicity 1
23 atoms
Cl 5.991539 -0.075967 -0.239899
O  -0.020992 -0.24527 0.223689
O  -2.891696 -0.250499 -0.854591
N  -3.1073 0.977672 1.062519
N  -4.386523 0.378146 0.778486
N  -5.10417 -1.096289 -1.029863
C  -0.833853 0.95782 -0.061707
C  1.373218 -0.113547 0.092528
C  -2.262193 0.602932 0.112504
C  2.043142 1.085624 -0.256302
C  2.111895 -1.297762 0.341751
C  3.454464 1.093765 -0.35703
C  3.51582 -1.288664 0.241776
C  4.171217 -0.088907 -0.108735
C  -4.203673 -0.334186 -0.347753
H  -0.634103 1.300225 -1.096814
H  -0.593716 1.768167 0.651815
H  1.498672 2.014776 -0.446354
H  1.572422 -2.209967 0.612231
H  3.980781 2.014734 -0.624049
H  4.090432 -2.19928 0.433421
H  -4.828667 -1.606133 -1.863715
H  -6.050619 -1.171093 -0.668208
