program: Gaussian 09
title: 000216143
version: EM64L-G09RevD.01
frameworkgroup: C1[X(C22H26N2O2)]
method: RPBEPBE
basis: SDD
operation: Freq
keyword: #p
keyword: freq=noraman
keyword: PBEPBE/SDD
title: #p freq=noraman PBEPBE/SDD
converged: YES YES NO NO
title: Mulliken charges:
elementType: O O N N C C C C C C C C C C C C C C C C C C C C C C H H H H H H H H H H H H H H H H H H H H H H H H H H
charge: -0.236976 -0.245660 -0.193533 -0.092811 -0.041750 0.236207 0.067297 0.240835 -0.408750 -0.434076 0.422549 -0.354535 -0.418096 -0.358094 -0.708531 -0.348581 -0.331057 -0.406625 -0.363230 -0.264218 -0.225301 -0.314575 -0.322751 -0.245333 -0.262215 -0.241922 0.217486 0.231884 0.256663 0.230046 0.223932 0.216865 0.258035 0.247903 0.230818 0.232653 0.218310 0.195663 0.209470 0.210895 0.200173 0.257958 0.265845 0.228917 0.226209 0.191048 0.214711 0.216954 0.192279 0.223837 0.225361 0.227815
chargesum: 0.00000
title: Mulliken charges with hydrogens summed into heavy atoms:
elementType: O O N N C C C C C C C C C C C C C C C C C C C C C C
charge: -0.236976 -0.245660 -0.193533 -0.092811 -0.041750 0.236207 0.067297 0.240835 0.040620 0.052633 0.422549 0.086262 -0.160060 -0.110191 -0.026750 0.056552 0.080011 -0.148667 -0.097385 -0.035300 0.000908 0.091184 0.086482 -0.021495 -0.036855 -0.014107
polarizability: 2.59481917e+02 -1.45283611e+01 2.68789225e+02 -1.55106365e+01 -2.51636221e+01 2.20146312e+02
1716.lowfreq: -5.0580 -0.0008 -0.0006 -0.0005 0.3833 4.8911 14.3592 25.7692 30.1338
frequency: 13.7074 25.6588 29.5299 41.4047 55.2291 73.8746 80.9806 90.5895 108.9167 111.9945 142.5687 160.7435 183.2109 204.9735 224.7676 236.4258 263.4690 267.7083 270.8941 287.4050 317.3902 323.8781 326.6174 357.2266 382.3027 404.4320 406.2843 431.7373 467.0134 469.8059 481.0185 489.2531 504.5373 562.4450 578.6808 611.9290 617.0761 626.7417 653.6269 687.7051 699.7635 706.6927 740.3329 755.3378 761.1139 769.9821 776.2973 784.2511 810.0684 834.2552 842.1113 853.5522 864.0178 894.8742 900.6365 917.9296 921.2445 943.1441 951.8329 976.2949 981.0457 990.3846 996.4196 999.4018 1021.4879 1026.3855 1029.1333 1031.9459 1045.8344 1054.2894 1059.1611 1075.7727 1080.2966 1083.6527 1092.3794 1109.4773 1113.2599 1127.8438 1137.4245 1152.7385 1167.0420 1173.1065 1175.4391 1191.6657 1197.2490 1199.4825 1232.3695 1244.9954 1265.4819 1272.8665 1281.4990 1294.0881 1298.8517 1312.6357 1322.6324 1329.1374 1334.0161 1335.7762 1341.2356 1352.1654 1369.2457 1373.8897 1376.8549 1393.0195 1395.6089 1409.2634 1433.1281 1443.5818 1448.8770 1451.3750 1454.3237 1459.0145 1461.6017 1465.9337 1479.0617 1480.7893 1482.9363 1485.1299 1486.6699 1587.6646 1599.5525 1608.1061 1619.0833 1644.5543 2870.3367 2875.9457 2891.9523 2953.2433 2957.5097 2983.6680 2995.7887 3016.1816 3024.7223 3028.6862 3045.6053 3054.5505 3077.7157 3080.6499 3083.2526 3084.3619 3086.8992 3122.1148 3127.2853 3132.9088 3135.6088 3148.5672 3150.3504 3158.3165 3165.8254 3166.9727
redmass: 5.1065 4.8855 3.1422 4.0087 4.4830 4.1678 3.1583 3.4236 3.4889 3.7274 5.2129 4.0505 1.7837 3.1294 3.1954 1.8420 3.2740 3.3038 1.7633 3.3716 4.4107 2.8932 3.2439 4.8369 2.7193 2.7659 2.4362 4.5234 3.1608 3.8457 7.8278 3.6644 3.5875 4.0560 2.7698 4.4359 6.0842 3.2449 4.0933 5.6108 4.3990 1.9467 2.5176 1.5546 1.8867 2.1501 1.8883 1.7831 3.5820 2.1394 1.7613 1.2596 1.3646 2.4194 3.0761 1.6540 2.9188 1.4962 2.1433 1.3359 1.3867 4.0817 1.4244 2.7951 2.6100 2.4875 2.4160 2.3957 3.3990 2.0665 2.4645 2.9653 2.3639 1.8650 2.6770 2.3061 1.8900 2.3966 2.6162 2.0391 2.0759 1.0614 1.2934 1.0982 1.1265 1.8146 2.3803 1.5960 1.3377 1.2987 1.3449 1.2567 1.3091 1.4300 1.3779 1.4621 1.2705 1.8940 2.0018 1.4914 1.3316 1.3877 6.6415 1.2169 1.4128 3.6732 2.2477 1.0820 1.0835 1.0985 2.3242 1.1002 1.1007 1.1471 1.2134 1.7891 1.0985 2.0560 1.2539 6.0238 7.4320 6.0337 7.5499 9.8870 1.0702 1.0700 1.0692 1.0665 1.0667 1.0356 1.0614 1.0591 1.0907 1.0893 1.0893 1.0997 1.0992 1.0961 1.1041 1.0976 1.1010 1.0847 1.0860 1.0888 1.0896 1.0931 1.0942 1.0949 1.1002 1.0996
irintensity: 0.0846 0.2731 0.0586 0.2714 1.4099 0.2167 0.1070 0.8061 2.2507 0.4129 1.7599 0.2020 1.7087 3.9555 0.2720 2.5653 2.4347 1.1405 0.3734 0.7740 14.5548 5.1780 3.8372 3.4649 4.2636 0.6919 3.3728 4.4406 1.8537 4.6206 7.6663 4.0841 13.1070 9.7735 1.0494 8.5963 1.2255 12.3894 5.4384 6.9139 7.8348 44.3094 0.2697 75.2326 33.1859 5.8651 26.8422 3.2544 23.5842 1.6432 1.3560 1.9230 0.9259 10.8991 4.5139 6.2720 2.6088 3.0599 3.1157 0.2782 0.4350 0.6257 0.2617 27.4330 3.0740 16.2226 6.3792 18.2607 31.2408 17.3613 12.6584 1.5479 5.1231 2.4655 49.3305 6.7934 2.9193 2.0406 82.2815 48.4803 6.2846 0.6265 0.5245 1.7824 8.3462 42.4157 12.4983 10.7490 11.1468 3.5288 11.5847 3.1367 21.3514 8.4627 6.7212 20.9528 0.8956 77.5655 22.4688 5.9347 0.2916 4.2607 0.2956 13.5993 1.4971 4.2251 9.5005 2.3699 3.6809 17.0649 31.0392 7.0072 10.8779 15.6084 45.1364 26.8576 17.0298 71.4924 21.2086 0.6733 48.6101 13.3311 125.5231 119.1883 46.3716 55.2004 100.2742 32.1892 104.9458 29.4118 23.9731 29.4935 5.5673 51.2171 35.7391 2.6508 40.2623 38.9446 9.8878 32.9633 34.9082 0.2149 2.2953 10.4815 13.8115 25.9778 23.0265 15.7792 25.9534 15.1088
temp: 298.150 k
press: 1.00000 atm
elementType: 8 8 7 7 6 6 6 6 6 6 6 6 6 6 6 6 6 6 6 6 6 6 6 6 6 6 1 1 1 1 1 1 1 1 1 1 1 1 1 1 1 1 1 1 1 1 1 1 1 1 1 1
symmnumber: 1
zpe: 1140255.5 jmol-1
zpe.correction: 0.434300 hartree
zpe.thermalcorrener: 0.457924 hartree
zpe.thermalcorrenthalpy: 0.458868 hartree
zpe.thermalcorrgfe: 0.379097 hartree
zpe.sumelectzpe: -1111.976597 hartree
zpe.sumelectthermal: -1111.952974 hartree
zpe.sumelectthermalent: -1111.952029 hartree
zpe.sumelectthermalfe: -1112.031801 hartree
dipole: 1.2974 2.6819 -1.4948
dipole: 3.3332
quadrupole: -163.0252 -149.1440 -150.2450
quadrupole: -6.4859 -2.1643 -2.0206
quadrupole: -8.8871 4.9941 3.8931 -6.4859 -2.1643 -2.0206
hfenergy: -1112.4108979 hartree
pointgroup: C01 [X(C22H26N2O2)]
dipole: -0.3948124 1.0991882 0.5963477 debye
polarizability: 261.3795165|15.8567637|266.2527986|-14.4260436|25.8617101|220.7851391 unknown
InChI: InChI=1S/C22H26N2O2/c1-2-22(18-8-4-3-5-9-18)19-10-6-7-11-20(19)24(21(22)25)13-12-23-14-16-26-17-15-23/h3-11H,2,12-17H2,1H3
charge 0 multiplicity 1
52 atoms
O  -0.48045 -1.215104 -1.925091
O  6.499875 -1.597159 0.045007
N  0.274707 0.643124 -0.680792
N  3.875271 -0.344266 0.020389
C  -2.101403 0.273477 -0.663117
C  -1.720085 1.551639 0.077682
C  -0.710466 -0.226156 -1.178326
C  -0.308368 1.711579 0.050124
C  -3.038325 0.555984 -1.890249
C  1.707468 0.45626 -0.93044
C  -2.72481 -0.826948 0.234168
C  2.425773 -0.196553 0.278005
C  -2.515226 2.532535 0.688673
C  0.332531 2.815597 0.643227
C  -2.476304 1.568051 -2.908976
C  4.678354 -0.434988 1.268753
C  4.193541 -1.492637 -0.872218
C  -3.059968 -0.600422 1.59268
C  -2.973382 -2.11178 -0.320952
C  -1.891843 3.658698 1.289669
C  -0.48374 3.790695 1.269773
C  6.176803 -0.461518 0.924614
C  5.697981 -1.510639 -1.186789
C  -3.649341 -1.623483 2.371418
C  -3.559394 -3.13226 0.45714
C  -3.907375 -2.891897 1.807012
H  -4.008986 0.910052 -1.492248
H  -3.229608 -0.407462 -2.396433
H  1.788568 -0.189437 -1.821881
H  2.182456 1.427493 -1.158043
H  2.296573 0.452991 1.164314
H  1.930199 -1.170724 0.509992
H  -3.606921 2.437177 0.698048
H  1.420719 2.932619 0.616033
H  -2.268772 2.54654 -2.440566
H  -1.541627 1.196378 -3.367217
H  -3.204463 1.730064 -3.724231
H  4.42504 -1.352364 1.857134
H  4.462207 0.447497 1.900552
H  3.627991 -1.399953 -1.816991
H  3.903805 -2.462651 -0.395799
H  -2.854157 0.371114 2.051155
H  -2.671872 -2.320699 -1.352604
H  -2.504125 4.428981 1.770216
H  -0.013892 4.662673 1.738363
H  6.459469 0.490895 0.425777
H  6.791033 -0.604416 1.829048
H  5.96935 -2.400877 -1.777749
H  5.970764 -0.590773 -1.747873
H  -3.902454 -1.42715 3.419695
H  -3.738601 -4.117217 0.011319
H  -4.364624 -3.683979 2.410705
