program: Gaussian 09
title: 000216090
version: EM64L-G09RevD.01
frameworkgroup: C1[X(C10H13NO2)]
method: RPBEPBE
basis: SDD
operation: Freq
keyword: #p
keyword: freq=noraman
keyword: PBEPBE/SDD
title: #p freq=noraman PBEPBE/SDD
converged: YES YES NO NO
title: Mulliken charges:
elementType: O O N C C C C C C C C C C H H H H H H H H H H H H H
charge: -0.397776 -0.409267 -0.300430 -0.126665 -0.586939 -0.575999 0.129961 0.354524 -0.031213 -0.458676 0.169842 -0.361955 -0.635754 0.226270 0.239974 0.239976 0.222864 0.222631 0.268159 0.240019 0.215372 0.226899 0.191584 0.224050 0.361476 0.351073
chargesum: 0.00000
title: Mulliken charges with hydrogens summed into heavy atoms:
elementType: O O N C C C C C C C C C C
charge: -0.036300 -0.058195 -0.032270 0.099605 -0.106989 -0.130504 0.129961 0.354524 -0.031213 -0.218657 0.169842 -0.146583 0.006779
polarizability: 1.57227988e+02 -8.38631262e-01 1.25247866e+02 -1.19184581e+01 2.05309682e+00 7.77313233e+01
1716.lowfreq: -4.8520 -0.0011 -0.0007 -0.0006 5.0234 11.2275 50.6390 98.7016 116.0604
frequency: 50.5714 98.6922 116.0438 138.7180 213.6495 232.5349 249.2429 270.9376 297.3427 320.7626 330.6989 349.1145 353.9756 435.0277 472.0847 491.9360 502.2143 562.1284 583.7204 620.1980 658.3175 711.7174 746.4680 755.8886 784.5940 851.6730 879.6442 898.0866 905.5009 918.4012 988.2026 1009.3285 1035.0923 1098.1102 1119.8563 1133.3892 1137.4825 1141.2751 1149.9468 1166.0875 1195.5490 1237.4089 1241.3841 1259.7806 1277.8326 1303.2325 1310.2629 1336.1697 1406.7772 1434.5838 1445.8270 1448.5836 1455.7402 1460.2741 1471.2400 1494.8885 1504.4439 1596.7059 1638.5550 2879.0135 2967.4725 2969.7587 3012.2300 3023.9687 3030.7999 3037.0785 3074.4532 3109.7710 3147.7439 3434.1192 3568.5356 3577.7617
redmass: 3.8872 3.3569 2.5003 3.0347 1.3853 4.3728 3.7405 2.1118 5.7238 1.7320 1.1387 2.2166 1.7607 3.3763 4.4821 4.0374 3.7104 3.7951 4.0699 2.6686 2.3716 4.4266 6.2163 3.8215 1.5322 1.9070 2.0306 1.7046 2.3595 2.1271 4.0431 1.6603 2.1273 1.4330 1.3094 1.6671 1.2827 1.6057 1.4380 2.3872 1.4806 1.7987 1.8641 1.9378 2.4475 1.4784 1.9660 1.2803 4.8972 1.1363 1.2944 1.6989 1.3547 1.3221 1.0801 1.0458 3.6235 8.0955 7.0321 1.0554 1.0652 1.0604 1.0754 1.0927 1.0950 1.0965 1.0993 1.0884 1.0953 1.0742 1.0657 1.0660
irintensity: 0.2131 0.8029 1.0005 0.7551 1.7074 4.3777 4.8826 4.9794 18.7024 97.3484 4.4375 15.9122 148.4841 1.8297 1.5964 1.3236 0.2258 6.2699 5.1349 60.7774 54.3593 7.8868 9.0234 3.1889 43.3616 10.8871 5.8149 1.7874 12.4190 6.5942 48.9330 16.1108 7.8049 0.8895 13.1854 159.8283 218.1394 32.4049 21.2259 128.7460 0.4287 13.7103 41.6673 4.9135 3.0583 12.8460 17.0255 12.0357 20.5865 1.8212 16.5395 17.5233 18.1731 12.7696 8.9677 16.9084 75.9800 22.1049 9.2907 115.4487 37.9967 25.7064 63.2129 27.8096 46.4005 29.3340 34.8242 18.5257 14.8854 0.9752 28.2501 33.4488
temp: 298.150 k
press: 1.00000 atm
elementType: 8 8 7 6 6 6 6 6 6 6 6 6 6 1 1 1 1 1 1 1 1 1 1 1 1 1
symmnumber: 1
zpe: 557044.7 jmol-1
zpe.correction: 0.212167 hartree
zpe.thermalcorrener: 0.224540 hartree
zpe.thermalcorrenthalpy: 0.225485 hartree
zpe.thermalcorrgfe: 0.174185 hartree
zpe.sumelectzpe: -593.064242 hartree
zpe.sumelectthermal: -593.051869 hartree
zpe.sumelectthermalent: -593.050924 hartree
zpe.sumelectthermalfe: -593.102224 hartree
dipole: 1.8627 2.1536 -0.3629
dipole: 2.8704
quadrupole: -75.4776 -72.8275 -76.9158
quadrupole: -8.0174 -2.5036 4.1043
quadrupole: -0.4040 2.2461 -1.8422 -8.0174 -2.5036 4.1043
hfenergy: -593.276409 hartree
pointgroup: C01 [X(C10H13N1O2)]
dipole: 0.7016003 -0.8305155 0.3054762 debye
dipolederiv: -0.1890586 0.25775 0.0668719 0.3587471 -1.2242976 0.1694726 0.0569112 0.1382355 -0.3710702 -1.32738 0.1988992 -0.3524025 0.2470351 -0.0597637 0.0743298 -0.3869745 0.0599455 -0.5408355 -0.6412195 0.0552878 0.1670959 0.0263043 -0.5771937 0.1596716 0.3194291 0.132094 -0.3692755 0.4881311 0.1067887 -0.0959076 0.1205865 0.2946025 0.013384 -0.3486815 -0.015137 0.4646257 -0.1102179 0.0680665 0.0107867 0.0271173 -0.0085388 -0.0050401 -0.0320647 -0.0213444 0.125363 -0.0697024 -0.0784657 0.0332146 -0.1187657 -0.0732647 0.0901636 -0.0119667 0.0150331 0.0527572 -0.0052713 0.188719 0.0214524 0.1769031 -0.0873871 0.0266168 0.0827251 0.0965766 -0.0906313 0.1091645 -0.0493908 0.0507407 -0.0649996 -0.0732337 0.0121252 0.1994099 -0.0108456 -0.0192972 -0.0956199 -0.1496825 -0.0394947 -0.480769 1.156027 -0.2225966 -0.0368718 -0.1299236 0.051212 -0.0852107 0.1078838 0.0448498 -0.0340008 0.0373921 -0.0405973 0.0247683 0.0229419 -0.1630702 1.2001199 -0.2539064 0.4564244 -0.0832351 -0.12328 -0.0311514 0.4645509 -0.0915033 0.2087325 -0.1694909 -0.0612993 0.0242749 0.186512 0.0101308 0.0702848 -0.0083359 -0.0311809 -0.1891022 0.5028294 -0.1085258 -0.0252882 -0.0725445 0.3675599 -0.0342078 0.065156 -0.0244034 0.1142157 -0.1164362 -0.0721635 -0.1193403 -0.0829342 0.0315135 -0.0370216 -0.0806844 -0.0393367 -0.0784322 0.0599182 -0.0329544 -0.0181159 -0.0489778 -0.0678721 0.0781219 -0.0041475 0.1236183 0.0094973 -0.0015059 0.003934 0.025731 -0.0170777 0.014497 -0.0843027 0.0037504 -0.1319963 -0.0944583 -0.0353647 -0.0095152 -0.0096929 -0.0428079 0.0731864 0.0301887 -0.0516956 0.0613346 -0.1828946 -0.0441653 0.0930498 -0.0096545 0.1232441 -0.0614607 -0.0412272 0.0483458 -0.0764355 0.0653031 0.0531346 0.004867 -0.0877849 -0.0086103 0.2199898 -0.1587302 -0.0787671 -0.0742456 0.101434 0.0776522 0.0566863 -0.0386897 0.0323964 -0.0923429 0.031711 -0.0308779 0.0376876 0.1447765 -0.0596545 -0.1126592 -0.0786709 -0.0976241 0.0044306 -0.0279264 -0.08302 -0.0384133 0.1397122 -0.0052639 0.006997 0.095041 0.0140256 0.0857805 0.0376107 0.1712185 0.0131199 -0.117009 -0.034157 -0.0135785 0.0243788 0.1277354 -0.2854385 0.0295791 -0.0423949 0.0793854 0.0639245 -0.0414522 -0.0297182 -0.0744048 -0.0636888 0.025209 -0.0837041 -0.1815882 -0.066203 -0.0251581 0.1557532 -0.1315268 -0.0737709 -0.1138961 0.3543858 -0.0330712 -0.0696621 -0.030309 0.3210585 0.384468 -0.0455426 0.0023558 -0.1106752 0.0593684 -0.0236835 0.0114677 0.0013051 0.378622 unknown
polarizability: 153.551657|2.2210183|125.1948442|20.4374483|-2.3255755|81.4606767 unknown
InChI: InChI=1S/C10H13NO2/c1-11-7-4-6-2-3-9(12)10(13)8(6)5-7/h2-3,7,11-13H,4-5H2,1H3
charge 0 multiplicity 1
26 atoms
O  -1.841926 2.190086 -0.475304
O  -3.604016 0.204208 -1.061259
N  2.935043 0.566596 -0.534379
C  2.206127 0.512535 0.752764
C  0.962959 1.459505 0.68362
C  1.589095 -0.896243 1.102478
C  -0.16974 0.525315 0.279293
C  0.18739 -0.828445 0.511838
C  -1.434134 0.866316 -0.237542
C  -0.720147 -1.860997 0.215831
C  -2.355425 -0.176987 -0.539289
C  -1.992339 -1.52469 -0.311343
C  4.224128 -0.147275 -0.571646
H  2.91493 0.837648 1.536748
H  1.168802 2.280745 -0.029657
H  0.765645 1.913937 1.675542
H  1.543365 -1.034882 2.202475
H  2.199011 -1.725699 0.698235
H  2.320767 0.310443 -1.320606
H  -0.459268 -2.910714 0.386286
H  -2.712765 -2.318157 -0.551792
H  4.684546 -0.020975 -1.56757
H  4.168068 -1.242501 -0.358417
H  4.910935 0.299358 0.17174
H  -1.103695 2.811102 -0.25165
H  -4.157154 -0.598229 -1.233192
