program: Gaussian 09
title: 000216088
version: EM64L-G09RevD.01
frameworkgroup: C1[X(C9H11NO2)]
method: RPBEPBE
basis: SDD
operation: Freq
keyword: #p
keyword: freq=noraman
keyword: PBEPBE/SDD
title: #p freq=noraman PBEPBE/SDD
converged: YES YES NO NO
title: Mulliken charges:
elementType: O O N C C C C C C C C C H H H H H H H H H H H
charge: -0.397089 -0.409241 -0.559434 -0.155666 -0.571888 -0.566575 0.125786 0.353834 -0.031358 -0.458199 0.170590 -0.361566 0.230898 0.241345 0.238177 0.219008 0.223717 0.239813 0.274897 0.265521 0.215450 0.360897 0.351082
chargesum: 0.00000
title: Mulliken charges with hydrogens summed into heavy atoms:
elementType: O O N C C C C C C C C C
charge: -0.036192 -0.058159 -0.019015 0.075232 -0.092367 -0.123850 0.125786 0.353834 -0.031358 -0.218386 0.170590 -0.146116
polarizability: 1.42139325e+02 -5.81603116e-01 1.16924977e+02 -7.81092770e+00 2.36009509e+00 6.57476755e+01
1716.lowfreq: -12.5473 -4.0731 -0.0008 -0.0008 -0.0007 6.7347 75.3687 121.8891 140.7020
frequency: 75.3359 121.8850 140.6972 236.4436 246.2281 265.6684 296.2096 320.5766 333.2635 356.2817 364.0958 419.0140 452.1914 486.7853 503.3110 559.4974 584.4428 624.1060 665.8982 711.9820 745.5678 760.7536 784.1416 824.9259 884.0605 897.9427 910.8150 924.7470 985.0087 1017.8899 1064.7498 1121.8055 1130.8506 1138.4337 1149.2059 1168.6901 1199.7135 1235.1040 1240.8329 1265.0414 1280.4377 1304.3008 1312.1713 1373.7502 1406.8491 1447.0710 1449.1079 1459.6267 1504.9177 1596.5062 1638.0317 1640.1103 2963.2488 2972.3690 3031.3135 3038.2993 3044.3390 3110.5721 3147.8870 3428.2135 3555.4754 3566.2130 3576.7652
redmass: 4.0653 3.5126 4.4787 3.0698 2.8989 1.2978 5.7048 1.9497 1.1911 1.5266 1.9844 2.4167 4.8555 4.2958 3.7493 3.7870 4.1149 3.9810 1.7256 4.4170 6.5128 3.6833 1.5451 2.6085 2.1075 1.4364 2.6973 1.7885 4.0806 2.1332 1.6544 1.2284 1.1348 1.3677 1.3983 2.3141 1.4416 1.7144 1.9408 2.1934 1.9773 1.4971 1.9393 1.3246 4.9167 1.2192 2.3122 1.3090 3.6694 8.0314 3.5672 1.2872 1.0650 1.0607 1.1000 1.0953 1.0904 1.0884 1.0954 1.0448 1.0965 1.0658 1.0660
irintensity: 0.0789 0.4175 1.4854 21.5614 12.4985 47.7629 16.0598 67.4138 9.4706 187.4834 3.5025 22.5627 4.4449 2.3280 0.3603 9.7690 2.7597 46.4998 188.0109 10.4797 11.5801 13.4626 39.3362 3.9165 7.7423 2.9497 17.2400 2.5264 38.9764 20.8031 11.3581 35.1122 8.5213 343.4395 10.9819 124.6672 0.1824 11.2678 33.2075 7.8296 1.3536 10.5318 15.9841 15.4496 20.4164 3.1944 20.5847 9.3792 77.8169 21.2807 12.4446 33.7578 41.9806 27.0438 12.0463 31.4072 72.4101 18.1507 15.2267 0.7858 0.1579 28.5506 33.0308
temp: 298.150 k
press: 1.00000 atm
elementType: 8 8 7 6 6 6 6 6 6 6 6 6 1 1 1 1 1 1 1 1 1 1 1
symmnumber: 1
zpe: 484857.1 jmol-1
zpe.correction: 0.184672 hartree
zpe.thermalcorrener: 0.195648 hartree
zpe.thermalcorrenthalpy: 0.196593 hartree
zpe.thermalcorrgfe: 0.148827 hartree
zpe.sumelectzpe: -553.849376 hartree
zpe.sumelectthermal: -553.838400 hartree
zpe.sumelectthermalent: -553.837456 hartree
zpe.sumelectthermalfe: -553.885222 hartree
dipole: 1.7957 2.4978 -0.1574
dipole: 3.0803
quadrupole: -66.6858 -66.8477 -71.1131
quadrupole: -6.1155 -2.6735 4.1602
quadrupole: 1.5298 1.3678 -2.8975 -6.1155 -2.6735 4.1602
hfenergy: -554.0340486 hartree
pointgroup: C01 [X(C9H11N1O2)]
dipole: 0.661368 -1.009314 0.1119109 debye
dipolederiv: -0.1270323 0.191212 0.0648328 0.2814634 -1.2815954 0.0120121 0.0664836 -0.0075918 -0.3737458 -1.3631863 0.32132 -0.1855052 0.3719041 -0.1154648 0.0919831 -0.2024251 0.0850402 -0.4340477 -0.4403208 -0.1820906 0.1995154 -0.2853061 -0.5675293 0.1529816 0.3133681 0.1560542 -0.5390153 0.4565012 0.1081324 -0.1062512 0.1345273 0.292253 -0.0074546 -0.2675607 -0.094608 0.549121 -0.0863399 0.0600206 0.0468168 0.0470951 -0.0183657 -0.0360366 -0.0076262 -0.0423635 0.1199037 -0.0622914 -0.0934645 0.0453577 -0.1079751 -0.0695378 0.0971987 -0.0324056 0.0317281 0.0685431 0.0310884 0.1969142 0.0252306 0.1509154 -0.1175251 0.0011204 0.0843672 0.0678176 -0.0986818 0.1252143 -0.0718138 0.0252393 -0.0869859 -0.0747 0.0202727 0.1585272 -0.0112217 -0.0502041 -0.1442703 -0.0715188 -0.0345747 -0.3938838 1.2115205 -0.0196846 -0.0645891 0.0264283 0.0460328 -0.0752772 0.1133015 0.0422548 -0.0387024 0.0330054 -0.0115342 0.0071656 0.0249493 -0.173948 1.2668864 -0.3953649 0.2465614 -0.2168389 -0.0759872 -0.0586537 0.2629435 -0.0906689 0.0790163 -0.1474252 -0.0553907 0.0140666 0.2042297 -0.0055613 0.0614994 0.0124498 0.0000863 -0.187405 -0.1558375 -0.0438353 -0.107149 -0.0615976 0.0459592 -0.0064617 -0.0945729 -0.0124314 -0.0663607 0.0477285 -0.0109493 -0.0215134 -0.0405844 -0.0935406 0.074302 0.0004836 0.1113092 0.0381804 0.0054386 -0.0202116 0.0004532 -0.0283845 0.0436912 -0.062663 -0.0303749 -0.1110621 -0.1201919 -0.0390624 0.0034743 -0.0296006 -0.0108343 0.0572305 0.0575143 -0.0842992 0.0987471 -0.1636447 -0.0463014 0.0692095 0.0283543 0.0927275 -0.0592235 -0.0683199 0.0906723 -0.1037056 0.0326415 0.0733618 0.0505849 -0.0183482 0.0272727 -0.1039506 -0.0020949 -0.0137856 0.0012289 0.1585546 0.0997114 -0.0086002 -0.1124727 -0.0075799 0.2562055 -0.1256164 -0.09548 -0.0488366 0.1191237 0.1848854 0.120661 -0.0000994 0.2792386 0.1695927 -0.0930015 0.0168336 -0.0178608 0.130066 -0.0916134 -0.1048447 -0.0595523 -0.0868372 0.0246477 -0.0253619 -0.0607655 -0.0330203 0.1544753 0.1175207 -0.1098726 -0.0574277 -0.0890104 0.3727166 -0.0100808 -0.0536014 -0.0026564 0.3380369 0.3706216 -0.0668736 -0.0061886 -0.1348533 0.0761591 -0.0419206 -0.0058082 -0.027362 0.3735495 unknown
polarizability: 140.9694393|-0.4206321|116.9581473|12.2872868|1.451045|66.8843905 unknown
InChI: InChI=1S/C9H11NO2/c10-6-3-5-1-2-8(11)9(12)7(5)4-6/h1-2,6,11-12H,3-4,10H2
charge 0 multiplicity 1
23 atoms
O  -1.362178 2.214992 -0.057678
O  -3.330611 0.413316 -0.577245
N  3.18177 0.361875 -1.102138
C  2.693383 0.18618 0.282813
C  1.528526 1.198061 0.545104
C  2.040568 -1.216983 0.582409
C  0.281885 0.383263 0.225498
C  0.571891 -1.006246 0.240694
C  -1.018903 0.852322 -0.040157
C  -0.441456 -1.944446 -0.023469
C  -2.047737 -0.095383 -0.30853
C  -1.751655 -1.478175 -0.298152
H  3.546275 0.377463 0.957933
H  1.675733 2.095819 -0.084917
H  1.528132 1.522566 1.605222
H  2.155175 -1.471862 1.656827
H  2.521451 -2.024419 -0.000088
H  -0.233871 -3.019558 -0.019119
H  2.440705 0.237728 -1.803769
H  4.002088 -0.213491 -1.323998
H  -2.555178 -2.196308 -0.510518
H  -0.555688 2.763619 0.113688
H  -3.959406 -0.331035 -0.750411
