program: Gaussian 09
title: 000210696
version: EM64L-G09RevD.01
frameworkgroup: C1[X(C14H19BrN2S2)]
method: RPBEPBE
basis: SDD
operation: Freq
keyword: #p
keyword: freq=noraman
keyword: PBEPBE/SDD
title: #p freq=noraman PBEPBE/SDD
converged: YES YES NO NO
title: Mulliken charges:
elementType: Br S S N N C C C C C C C C C C C C C C H H H H H H H H H H H H H H H H H H H
charge: 0.005792 0.257720 0.065541 -0.018960 -0.087461 -0.391235 -0.406925 -0.341599 -0.665718 -0.341167 0.465347 -0.661656 -0.688904 -0.500954 -0.378109 0.574785 -0.166871 -0.395220 -0.817667 0.205603 0.221063 0.263422 0.256594 0.229335 0.221019 0.284839 0.268358 0.189035 0.191276 0.215580 0.217080 0.216409 0.277092 0.245709 0.250953 0.249223 0.233515 0.257157
chargesum: 0.00000
title: Mulliken charges with hydrogens summed into heavy atoms:
elementType: Br S S N N C C C C C C C C C C C C C C
charge: 0.005792 0.257720 0.065541 -0.018960 -0.087461 0.035430 0.113091 0.108755 -0.112521 0.039143 0.465347 -0.661656 -0.039834 -0.223862 -0.132400 0.574785 0.084082 -0.395220 -0.077771
polarizability: 3.02791610e+02 -1.27732408e+01 1.94787791e+02 -1.93576901e+01 -1.59260174e+01 1.70374605e+02
1716.lowfreq: -3.1098 0.0012 0.0022 0.0025 4.7483 9.1456 16.1284 26.5063 39.2415
frequency: 15.7503 26.4816 39.1444 44.2165 45.8493 77.5960 84.8571 114.8598 123.9852 127.4075 140.1001 164.8295 168.4020 202.6688 221.1879 225.2048 266.4345 279.7378 314.0061 321.7806 344.9280 362.1271 388.0678 417.2228 438.3434 443.1364 462.8764 483.4983 521.2269 532.6541 542.7899 567.9577 616.9928 654.2368 712.2808 723.5885 729.6814 784.5002 811.3334 856.7190 872.9301 887.0053 900.9293 903.8229 910.8608 931.9087 945.7100 978.8025 1000.2729 1006.6354 1010.8281 1047.6949 1049.9974 1066.4855 1091.4284 1111.4680 1113.5848 1133.7105 1170.0891 1183.8374 1215.7172 1222.1086 1252.5511 1265.2413 1270.3526 1273.2856 1294.6786 1305.4558 1343.0660 1352.4149 1356.3252 1364.2626 1369.2274 1390.2117 1392.2534 1404.4229 1405.7769 1444.2280 1452.2193 1455.0477 1463.4290 1468.2263 1469.3690 1474.9707 1477.9812 1479.1007 1490.0971 1573.6351 1601.0596 2957.6179 2971.4098 2977.5504 2984.7148 2984.8313 2993.9320 3002.4702 3024.0991 3038.9317 3059.8067 3063.4739 3075.6657 3076.2065 3092.6318 3097.2247 3131.0547 3145.7563 3156.9656 3172.0241
redmass: 4.2180 4.2692 3.7700 5.1746 4.1513 2.0375 6.7577 4.4175 2.1371 5.5566 1.0629 3.6125 7.5665 4.3958 3.0393 1.1908 6.6774 5.1169 5.0120 4.3282 4.5639 4.9715 4.1966 3.6815 3.0206 2.9514 3.7620 3.2107 7.6635 5.5375 5.4547 5.0116 5.1893 7.4152 3.5746 6.0048 1.0832 1.1818 1.4160 3.3262 2.6544 1.6674 2.3569 1.9715 2.0588 1.4834 1.3847 2.3651 2.8586 4.0680 2.2867 1.6262 2.2120 2.6218 2.1999 2.2658 1.5687 1.4045 1.7342 2.0333 1.4601 1.8625 1.3031 1.3371 1.2968 1.3701 1.1088 1.9370 1.3921 1.7015 1.5614 8.5566 1.5497 2.9954 1.2459 1.2212 1.9313 1.0935 2.2505 1.0931 1.0447 1.1051 1.0763 1.0426 1.2290 1.0963 1.0896 6.7954 6.9070 1.0592 1.0594 1.0362 1.0581 1.0453 1.0610 1.0990 1.1022 1.0577 1.1043 1.0972 1.1003 1.1002 1.0991 1.0995 1.1111 1.0890 1.0925 1.0965
irintensity: 0.2415 0.1930 0.8155 1.9058 0.3361 0.4512 0.4744 0.4850 0.1517 0.9800 0.4122 1.3465 0.7869 1.5730 3.4775 0.5463 4.0389 1.1108 5.3835 1.8607 3.5120 4.2952 6.5139 2.6636 2.1765 4.5612 3.1794 4.0931 2.7349 4.1994 25.2687 2.7214 34.5179 33.6476 11.0157 34.7866 6.4761 1.1657 22.3231 5.2254 35.2565 2.6420 33.0997 5.6941 7.6316 8.3797 0.6621 55.6201 5.1706 20.6402 116.2790 9.3511 58.4216 2.6235 62.6208 15.1865 37.5448 3.1227 46.9552 7.2960 13.4018 23.4157 34.2438 32.1585 11.9442 11.3434 5.0143 95.2256 0.6784 44.5590 32.0257 3.2348 16.4603 28.0759 12.4966 19.2664 75.4650 11.8091 73.5262 8.3709 12.4046 13.5885 1.9108 11.6262 76.5876 14.6330 20.5264 1.5122 10.7049 28.6285 45.9062 29.3494 25.4713 33.2022 40.0655 15.1411 4.2400 39.5324 26.5644 10.4500 77.8500 53.5299 11.3132 16.0447 8.7711 7.6185 2.7648 4.4655
temp: 298.150 k
press: 1.00000 atm
elementType: 35 16 16 7 7 6 6 6 6 6 6 6 6 6 6 6 6 6 6 1 1 1 1 1 1 1 1 1 1 1 1 1 1 1 1 1 1 1
symmnumber: 1
zpe: 795814.2 jmol-1
zpe.correction: 0.303110 hartree
zpe.thermalcorrener: 0.324054 hartree
zpe.thermalcorrenthalpy: 0.324998 hartree
zpe.thermalcorrgfe: 0.249811 hartree
zpe.sumelectzpe: -1462.527183 hartree
zpe.sumelectthermal: -1462.506239 hartree
zpe.sumelectthermalent: -1462.505294 hartree
zpe.sumelectthermalfe: -1462.580481 hartree
dipole: 1.5162 2.2239 -4.9829
dipole: 5.6633
quadrupole: -132.9641 -135.8946 -145.5225
quadrupole: 11.7267 -9.9798 7.7299
quadrupole: 5.1630 2.2324 -7.3954 11.7267 -9.9798 7.7299
hfenergy: -1462.8302927 hartree
pointgroup: C01 [X(C14H19Br1N2S2)]
dipole: 0.9837201 0.2620295 -1.9819705 debye
polarizability: 277.8321099|-50.4590097|217.7438422|-11.8276307|-16.5274296|172.3780536 unknown
InChI: InChI=1S/C14H19BrN2S2/c1-3-4-7-16-9-17(14(18)19-10-16)12-5-6-13(15)11(2)8-12/h5-6,8H,3-4,7,9-10H2,1-2H3
charge 0 multiplicity 1
38 atoms
Br -4.455025 3.176691 -0.634358
S  2.027909 -2.679441 0.912597
S  -0.194045 -1.346054 2.414205
N  2.476475 -1.128134 -1.449731
N  0.321544 -0.784873 -0.224358
C  3.293091 0.088576 -1.198721
C  1.04259 -0.999842 -1.556276
C  3.385164 0.604713 0.261109
C  2.880656 -2.372939 -0.865385
C  4.283838 1.859811 0.354062
C  -0.799908 0.13657 -0.267064
C  0.620192 -1.49547 0.924102
C  4.406926 2.393933 1.797353
C  -2.123593 -0.342613 -0.143938
C  -0.564448 1.509949 -0.500608
C  -3.241725 0.522255 -0.240888
C  -1.658207 2.395389 -0.610936
C  -2.96845 1.895577 -0.480782
C  -4.64628 -0.020447 -0.085985
H  2.88206 0.887081 -1.84817
H  4.315874 -0.121082 -1.569784
H  0.633278 -1.922843 -2.012257
H  0.771419 -0.139647 -2.187272
H  3.791887 -0.189812 0.915843
H  2.377621 0.840068 0.653216
H  2.561093 -3.234739 -1.47091
H  3.962051 -2.403874 -0.668956
H  3.876197 2.657431 -0.301809
H  5.293452 1.620283 -0.039683
H  5.049039 3.292565 1.841716
H  3.415718 2.663834 2.206547
H  4.845179 1.630035 2.466016
H  -2.288631 -1.406073 0.054445
H  0.459217 1.892362 -0.571773
H  -1.489601 3.46179 -0.784143
H  -5.261347 0.188895 -0.980485
H  -4.631039 -1.109934 0.080541
H  -5.161369 0.451712 0.770918
