program: Gaussian 09
title: 000210695
version: EM64L-G09RevD.01
frameworkgroup: C1[X(C11H12BrClN2OS2)]
method: RPBEPBE
basis: SDD
operation: Freq
keyword: #p
keyword: freq=noraman
keyword: PBEPBE/SDD
title: #p freq=noraman PBEPBE/SDD
converged: YES YES NO NO
title: Mulliken charges:
elementType: Br Cl S S O N N C C C C C C C C C C C H H H H H H H H H H H H
charge: 0.062878 -0.006897 0.260848 0.085391 -0.430715 -0.022958 -0.083632 -0.433801 -0.364933 -0.652592 0.470626 -0.660951 -0.358063 -0.291970 -0.342497 -0.041756 -0.152278 -0.232660 0.260469 0.310777 0.225299 0.233224 0.290453 0.265943 0.213911 0.247276 0.267672 0.280641 0.256170 0.344127
chargesum: 0.00000
title: Mulliken charges with hydrogens summed into heavy atoms:
elementType: Br Cl S S O N N C C C C C C C C C C C
charge: 0.062878 -0.006897 0.260848 0.085391 -0.086588 -0.022958 -0.083632 0.137446 0.093589 -0.096196 0.470626 -0.660951 0.103123 -0.024298 -0.061856 -0.041756 0.103891 -0.232660
polarizability: 2.93129728e+02 3.28564059e+00 1.71156743e+02 -6.41066939e+00 2.06410834e+01 1.51780742e+02
1716.lowfreq: -12.4073 -5.0407 -1.4974 -0.0010 0.0022 0.0026 16.9747 25.6740 32.8954
frequency: 14.4058 25.5921 32.7178 57.1043 61.9423 84.4358 120.4582 129.8413 143.8923 150.0490 163.5081 194.5421 245.6094 265.5222 289.4805 292.5820 310.0832 331.7954 357.8955 392.1152 413.0040 433.4126 436.6337 450.9932 456.9392 524.5060 535.8678 557.5077 579.2124 621.4792 649.4511 674.9821 699.0635 789.6480 812.0253 831.2094 852.7270 867.7152 892.1889 914.0526 952.4158 957.9372 977.5661 993.9671 1029.0249 1050.8119 1059.7270 1106.2743 1114.4965 1141.3863 1146.8434 1187.9931 1190.1315 1239.3020 1245.2035 1255.0271 1276.1882 1290.4763 1325.9597 1349.9739 1355.3962 1377.6352 1382.6215 1388.6451 1399.7381 1450.9120 1453.1058 1471.3679 1475.1747 1491.8690 1559.8579 1586.7448 2921.7164 2975.3590 3005.2320 3008.0773 3049.3633 3076.1156 3107.9123 3136.6891 3163.5101 3168.7108 3183.3830 3570.0429
redmass: 6.4080 9.3924 6.4180 6.8680 6.1586 8.5415 4.4754 4.1761 4.8850 11.0488 10.4208 6.8671 7.3921 1.9181 9.6948 1.8164 2.6514 6.9193 7.4923 4.8132 8.6872 2.5720 4.0440 4.0757 5.7287 5.9024 8.8083 5.8447 2.9165 5.6263 6.8886 7.3141 3.5756 2.8507 1.5283 4.4863 2.2362 1.6114 2.0062 2.7818 1.3883 2.7283 3.1625 5.0910 1.7884 2.5192 2.2486 2.2336 2.0273 1.4742 1.5975 1.5932 1.6783 1.2798 1.1796 1.3746 1.9436 2.4684 1.3620 2.3373 2.4290 2.2788 1.7421 1.3562 1.7668 1.2022 2.2581 1.0837 1.0995 1.0789 8.2866 6.6721 1.0656 1.0700 1.0849 1.0733 1.0566 1.0957 1.1021 1.1128 1.0887 1.0926 1.0975 1.0662
irintensity: 0.2485 0.9664 1.3401 4.1089 0.3581 3.3143 3.1409 7.2350 8.9713 1.5105 1.5596 0.6908 5.2046 87.6919 9.5533 45.7004 45.9997 4.6053 5.6691 5.3962 9.4073 8.2300 5.2254 6.5182 14.5121 11.6783 13.0941 9.7478 20.8429 21.8836 24.0048 42.0911 6.2887 7.3476 22.8360 63.5665 29.3944 14.5772 6.4512 3.7568 4.3879 9.7634 84.6481 60.6783 119.1720 50.6231 5.4220 48.5298 46.1673 4.1606 11.8121 66.1907 63.9329 3.0731 21.6152 58.5860 12.5347 193.9855 47.4196 15.1351 0.5074 2.0807 8.2852 10.8679 92.1805 80.8369 133.7200 11.7772 12.5364 10.5621 42.2458 8.6317 27.1475 65.5835 28.2381 24.9742 31.6913 28.4356 5.4127 7.3421 2.1053 1.6471 1.5643 8.6288
temp: 298.150 k
press: 1.00000 atm
elementType: 35 17 16 16 8 7 7 6 6 6 6 6 6 6 6 6 6 6 1 1 1 1 1 1 1 1 1 1 1 1
symmnumber: 1
zpe: 564075.6 jmol-1
zpe.correction: 0.214845 hartree
zpe.thermalcorrener: 0.233540 hartree
zpe.thermalcorrenthalpy: 0.234484 hartree
zpe.thermalcorrgfe: 0.164036 hartree
zpe.sumelectzpe: -1879.364762 hartree
zpe.sumelectthermal: -1879.346067 hartree
zpe.sumelectthermalent: -1879.345122 hartree
zpe.sumelectthermalfe: -1879.415571 hartree
dipole: -4.1643 4.9860 -1.1186
dipole: 6.5919
quadrupole: -128.0291 -152.4674 -128.0961
quadrupole: -22.1937 -3.1146 -2.2067
quadrupole: 8.1684 -16.2699 8.1014 -22.1937 -3.1146 -2.2067
hfenergy: -1879.5796066 hartree
pointgroup: C01 [X(C11H12Br1Cl1N2O1S2)]
dipole: 2.3835783 -0.9119451 0.4614015 debye
polarizability: 255.5110908|63.1880219|188.2455126|11.1294733|-16.8305565|172.3106091 unknown
InChI: InChI=1S/C11H12BrClN2OS2/c12-9-2-1-8(5-10(9)13)15-6-14(3-4-16)7-18-11(15)17/h1-2,5,16H,3-4,6-7H2
charge 0 multiplicity 1
30 atoms
Br -4.386291 -2.917235 -0.590298
Cl -3.529008 -1.450303 2.352492
S  2.422933 2.782972 -0.578526
S  -0.293678 2.571427 -1.809558
O  2.852709 -2.565611 1.182919
N  2.943643 0.342513 0.796133
N  0.60641 0.746209 0.042896
C  1.541457 0.314146 1.17059
C  3.392216 -0.583473 -0.275578
C  3.458066 1.680509 0.71584
C  -0.587539 -0.053005 -0.125362
C  0.818851 1.891112 -0.715325
C  2.781464 -1.991725 -0.165048
C  -1.404777 -0.312449 0.997754
C  -0.905254 -0.63857 -1.375602
C  -2.526743 -1.158455 0.872161
C  -2.030925 -1.473814 -1.493281
C  -2.849336 -1.743626 -0.369895
H  1.403397 0.996192 2.030294
H  1.247179 -0.703909 1.463807
H  4.495762 -0.648956 -0.198372
H  3.156024 -0.184501 -1.289203
H  3.371773 2.209214 1.676007
H  4.490768 1.706229 0.338548
H  3.286525 -2.642466 -0.909207
H  1.705067 -1.983423 -0.403543
H  -1.192301 0.15494 1.963439
H  -0.285779 -0.428511 -2.25097
H  -2.279717 -1.925424 -2.457522
H  3.775508 -2.477704 1.531514
