program: Gaussian 09
title: 000216140
version: EM64L-G09RevD.01
frameworkgroup: C1[X(C22H24N2O)]
method: RPBEPBE
basis: SDD
operation: Freq
keyword: #p
keyword: freq=noraman
keyword: PBEPBE/SDD
title: #p freq=noraman PBEPBE/SDD
converged: NO YES NO NO
title: Mulliken charges:
elementType: O N N C C C C C C C C C C C C C C C C C C C C C C H H H H H H H H H H H H H H H H H H H H H H H H
charge: -0.201022 -0.093661 -0.458771 -0.131924 -0.423920 -0.639026 -0.361584 0.148044 -0.510085 0.269892 -0.503193 0.116222 0.142160 0.220864 0.458841 -0.412913 -0.811346 -0.362189 -0.442501 -0.371950 -0.267836 -0.222835 -0.217066 -0.227698 -0.244216 0.254810 0.274222 0.183837 0.239573 0.235172 0.190406 0.217303 0.231460 0.232412 0.221113 0.199874 0.297857 0.226719 0.232271 0.239986 0.252191 0.225035 0.231435 0.255462 0.216886 0.218124 0.224230 0.221664 0.225671
chargesum: 0.00000
title: Mulliken charges with hydrogens summed into heavy atoms:
elementType: O N N C C C C C C C C C C C C C C C C C C C C C C
charge: -0.201022 -0.093661 -0.160915 0.122885 0.034139 -0.164281 0.046125 0.148044 -0.046213 0.269892 -0.082206 0.116222 0.142160 0.220864 0.458841 -0.186194 -0.086898 -0.137153 -0.211065 -0.116488 -0.050949 -0.004712 0.007164 -0.006034 -0.018544
polarizability: 2.28721139e+02 -5.82189732e+01 2.42790095e+02 -4.66503462e-01 -1.60137504e+01 2.48367502e+02
1716.lowfreq: -8.0519 -2.5137 0.0002 0.0005 0.0008 6.3568 8.7256 20.4087 23.5709
frequency: 8.4733 20.3821 23.3951 32.8144 43.4805 56.9267 76.5065 106.0302 121.5006 135.3501 137.9695 176.1889 188.3440 204.8473 238.2349 264.2771 275.1442 290.8411 304.2957 330.3274 344.7837 371.1283 405.6136 427.9079 430.6057 450.7918 465.8184 483.8299 494.9114 498.5970 519.0993 542.9990 577.1712 587.2628 602.8909 616.5168 647.2265 659.0616 687.2962 704.7826 728.0205 741.0012 746.0610 753.4592 775.6261 808.9707 814.1721 831.2086 846.9590 858.0124 861.1003 882.7476 909.4176 917.0443 925.3312 964.3025 964.8523 967.6985 980.7369 983.0827 990.1651 994.8487 1005.2276 1010.5552 1025.1188 1033.0844 1039.8450 1066.4605 1080.4764 1094.3802 1110.9400 1120.5048 1131.3204 1147.5322 1151.9536 1168.2999 1169.8508 1174.5749 1181.1973 1197.3816 1210.7802 1225.5426 1235.6670 1239.3386 1258.7978 1266.0806 1278.4168 1288.9658 1302.1216 1307.6836 1315.2322 1325.8474 1338.9527 1346.0715 1364.5807 1375.8801 1392.5031 1395.9071 1413.2841 1429.5874 1433.0730 1440.8138 1461.0258 1463.3961 1467.9837 1470.7516 1471.8997 1475.8447 1481.4943 1482.2628 1485.3024 1579.1004 1594.1176 1595.1668 1614.8742 1621.1245 1633.3304 2837.2766 2847.1127 2865.1927 2959.2742 2964.2903 2988.7704 2992.1221 2995.4851 3030.7501 3033.7261 3046.9360 3062.0682 3080.9002 3090.0122 3114.5606 3118.6385 3121.6260 3125.8448 3136.0532 3140.3046 3147.2375 3159.6618 3161.7281 3603.9327
redmass: 4.5108 5.6444 3.9525 4.1242 7.0466 4.5200 3.8013 1.1741 2.5129 3.1503 4.1156 4.6967 2.9712 4.8092 2.8201 3.5430 3.7473 4.0573 2.4091 4.1470 2.4843 2.1465 2.8334 3.2517 2.8883 3.3523 3.2475 5.1411 1.5697 2.1292 3.7640 3.4940 3.3807 4.9959 4.6552 6.3552 4.4321 4.7340 3.3371 2.0739 3.7327 1.7510 1.4222 2.7832 3.0291 3.4103 2.3114 2.6348 1.5506 1.2492 3.5330 2.8789 2.1392 1.6183 1.3860 1.4622 1.6619 1.4938 1.3914 1.7027 5.7383 1.4236 1.9413 2.1070 2.1953 2.4605 1.4892 2.5147 1.5986 3.1087 1.9540 2.7917 2.4425 1.9372 1.3600 1.1744 1.0596 1.5856 1.1100 1.3790 2.5017 1.3389 1.3983 2.1705 1.6460 1.4611 1.3762 1.4703 1.3297 2.9831 1.4199 1.4740 1.4545 1.8598 1.4968 2.2597 2.5495 1.5288 2.7871 2.7009 1.0917 2.1095 1.2803 1.1092 1.0663 2.2279 1.2718 1.2571 1.6686 2.3176 1.2909 6.6270 6.3296 6.1661 6.1735 9.9590 6.7448 1.0709 1.0706 1.0702 1.0801 1.0395 1.0868 1.0630 1.0610 1.0883 1.0974 1.1000 1.0886 1.0989 1.0958 1.0867 1.0848 1.0864 1.0888 1.0913 1.0948 1.0956 1.1000 1.1014 1.0803
irintensity: 0.5444 0.1562 0.5155 0.5397 1.9229 0.2942 1.8066 0.1082 0.4782 2.1334 2.6865 0.5725 4.4708 6.2760 1.0581 0.6761 0.7272 0.8628 1.3708 0.7500 0.6057 6.4649 0.3398 1.6622 8.4568 4.3192 8.6058 0.3046 73.0226 30.7467 4.0409 0.3066 8.2586 4.0608 1.1346 0.1088 2.9262 4.4005 2.7375 38.3124 1.4698 110.7797 50.2074 7.6753 17.1960 2.0435 4.0681 4.3128 0.1368 1.4351 1.4314 15.5048 1.4571 2.8652 3.0038 0.7823 1.5505 1.3858 1.1726 0.1253 0.1094 4.3515 14.6366 12.2110 21.9706 11.7558 2.9963 4.2364 7.7030 1.8699 10.2446 11.0702 37.0418 4.7391 2.2884 2.8193 0.2960 45.9620 0.9653 8.2152 2.1203 13.2344 5.8598 10.8123 44.5678 22.5352 12.2302 8.0330 11.3802 24.2968 18.6213 13.4849 37.6350 10.7986 0.7246 4.1468 1.3428 1.3530 29.4543 19.1023 15.5346 10.8891 11.7342 4.1374 14.7776 25.8028 12.8517 6.7241 12.3528 3.9232 5.6854 3.3550 9.2816 1.0135 9.3860 174.5165 3.3634 52.3419 63.9413 137.6697 6.8168 57.9597 23.9270 11.9042 17.1000 48.7965 22.8472 13.9881 11.4391 27.2122 13.9821 7.1196 4.2091 0.2671 3.4142 16.6963 39.0925 31.2807 31.8959 23.6509 44.6769
temp: 298.150 k
press: 1.00000 atm
elementType: 8 7 7 6 6 6 6 6 6 6 6 6 6 6 6 6 6 6 6 6 6 6 6 6 6 1 1 1 1 1 1 1 1 1 1 1 1 1 1 1 1 1 1 1 1 1 1 1 1
symmnumber: 1
zpe: 1067149.4 jmol-1
zpe.correction: 0.406456 hartree
zpe.thermalcorrener: 0.428910 hartree
zpe.thermalcorrenthalpy: 0.429854 hartree
zpe.thermalcorrgfe: 0.351267 hartree
zpe.sumelectzpe: -1035.673246 hartree
zpe.sumelectthermal: -1035.650792 hartree
zpe.sumelectthermalent: -1035.649848 hartree
zpe.sumelectthermalfe: -1035.728435 hartree
dipole: 0.1129 2.8186 2.4296
dipole: 3.7229
quadrupole: -138.6115 -164.8075 -130.7631
quadrupole: -3.4063 -11.4396 -6.4587
quadrupole: 6.1159 -20.0801 13.9642 -3.4063 -11.4396 -6.4587
hfenergy: -1036.0797019 hartree
pointgroup: C01 [X(C22H24N2O1)]
dipole: -0.0553403 -1.2583643 -0.7475544 debye
polarizability: 249.3378381|57.0078618|219.7367628|-12.8772327|-5.0627844|250.8041348 unknown
InChI: InChI=1S/C22H24N2O/c1-16-20(19-9-5-6-10-21(19)23-16)13-18-15-24(12-11-22(18)25)14-17-7-3-2-4-8-17/h2-10,18,23H,11-15H2,1H3
charge 0 multiplicity 1
49 atoms
O  2.64601 3.808923 -0.08397
N  2.615195 -0.233235 0.691977
N  -2.723172 0.739751 -2.039944
C  1.420538 1.696508 -0.370721
C  1.353938 0.540984 0.668066
C  0.127554 2.55404 -0.406008
C  3.756367 0.608009 1.1104
C  2.673156 2.548574 -0.120002
C  3.965279 1.761583 0.09678
C  -1.111315 1.783509 -0.798247
C  2.503952 -1.496691 1.462081
C  -2.109699 1.22632 0.101385
C  -1.518539 1.46976 -2.101514
C  -3.110023 0.57617 -0.706077
C  1.622325 -2.535813 0.77489
C  -2.262671 1.220325 1.51353
C  -0.880116 1.789012 -3.423762
C  -4.234728 -0.067808 -0.147608
C  0.714786 -3.32403 1.523057
C  1.736267 -2.760054 -0.620713
C  -3.383938 0.581004 2.078776
C  -4.359553 -0.057808 1.257559
C  -0.059813 -4.325942 0.89342
C  0.963288 -3.757927 -1.252852
C  0.063619 -4.547325 -0.496961
H  1.565896 1.206839 -1.358202
H  0.523433 -0.132737 0.399329
H  1.121655 0.972558 1.677189
H  0.303047 3.3999 -1.096347
H  -0.015341 3.017745 0.588458
H  3.603477 1.043705 2.131489
H  4.667308 -0.017135 1.151825
H  4.757539 2.452794 0.432149
H  4.268663 1.317106 -0.871817
H  3.530507 -1.903816 1.562468
H  2.12842 -1.324894 2.502306
H  -3.231624 0.391648 -2.849972
H  -1.522319 1.710881 2.156354
H  -1.604474 2.231877 -4.134411
H  -0.449006 0.889729 -3.906628
H  -0.06256 2.515996 -3.28773
H  -4.987785 -0.558585 -0.774925
H  0.607155 -3.149205 2.601074
H  2.425438 -2.13187 -1.196287
H  -3.51417 0.572741 3.166866
H  -5.220824 -0.547234 1.726181
H  -0.762498 -4.924445 1.484229
H  1.060942 -3.922745 -2.332328
H  -0.537785 -5.321493 -0.987012
