program: Gaussian 09
title: 000210694
version: EM64L-G09RevD.01
frameworkgroup: C1[X(C13H16Cl2N2S2)]
method: RPBEPBE
basis: SDD
operation: Freq
keyword: #p
keyword: freq=noraman
keyword: PBEPBE/SDD
title: #p freq=noraman PBEPBE/SDD
converged: YES YES NO NO
title: Mulliken charges:
elementType: Cl Cl S S N N C C C C C C C C C C C C C H H H H H H H H H H H H H H H H
charge: -0.011103 0.000068 0.266932 0.079022 -0.022940 -0.084707 -0.398965 -0.381754 -0.336911 -0.665454 -0.339678 0.477318 -0.657039 -0.689236 -0.311320 -0.318781 -0.061229 -0.195098 -0.128268 0.214010 0.219529 0.256393 0.253335 0.226102 0.213500 0.288877 0.267444 0.194473 0.192198 0.219020 0.209986 0.217043 0.265796 0.280223 0.261214
chargesum: 0.00000
title: Mulliken charges with hydrogens summed into heavy atoms:
elementType: Cl Cl S S N N C C C C C C C C C C C C C
charge: -0.011103 0.000068 0.266932 0.079022 -0.022940 -0.084707 0.034575 0.127975 0.102692 -0.109132 0.046993 0.477318 -0.657039 -0.043188 -0.045524 -0.038558 -0.061229 0.066116 -0.128268
polarizability: 2.85072012e+02 -2.40164985e+01 1.69268835e+02 -2.68563867e+00 1.01752840e+01 1.94079564e+02
1716.lowfreq: -3.3843 -0.0020 0.0017 0.0020 1.9889 5.5481 17.3565 29.7686 38.2595
frequency: 16.3167 29.5370 38.2154 44.5397 60.4621 72.8966 86.6759 105.1580 116.8025 142.9464 165.0461 168.3818 190.1375 211.0920 224.9095 267.4468 290.2024 302.3466 324.4468 346.2352 367.3820 388.8265 418.3595 435.7873 441.4752 451.7419 476.6441 487.0264 532.7111 538.3057 564.7155 622.0927 656.9594 678.3058 696.2920 733.7158 785.8986 807.0805 831.9588 856.7909 863.7151 885.6454 903.1744 907.3220 929.7815 944.3680 975.5700 999.8540 1006.1981 1048.0737 1068.7767 1093.8916 1112.0381 1116.9154 1118.7511 1142.9844 1183.5532 1198.9835 1217.4955 1248.3755 1260.9584 1268.9521 1272.6391 1289.8820 1295.3306 1342.9134 1350.1580 1358.5085 1362.1097 1375.1985 1383.7603 1390.3187 1403.6354 1444.4156 1454.0507 1458.7818 1468.6943 1470.0263 1475.5567 1478.8986 1489.1912 1563.2256 1590.3990 2962.1529 2975.5413 2976.7765 2987.6349 2990.8443 3006.0622 3028.4733 3038.3786 3058.6443 3073.5285 3076.7090 3093.7512 3131.9149 3164.0475 3167.4902 3185.4479
redmass: 5.1534 8.0648 3.5035 4.1652 3.2400 3.3466 4.6436 4.3436 2.5253 4.8151 12.6468 4.0704 14.3562 6.1928 1.1133 10.4678 8.7975 3.6927 5.4966 5.2989 4.3586 5.6556 4.2650 2.9338 3.9071 4.7783 3.9146 5.0619 6.6087 8.3536 5.4290 5.9092 7.5279 7.5198 3.6945 1.0761 1.1806 1.4519 5.7280 2.5440 2.0630 1.9933 2.0201 2.0424 1.4175 1.3579 3.2525 5.1911 3.9053 2.5390 2.5916 2.2018 2.2634 1.7140 1.9957 1.3558 2.1991 1.8563 1.4293 1.2847 1.3155 1.2883 1.3834 1.4165 1.5440 1.5172 2.0716 2.1414 1.5809 1.7082 3.4434 1.2125 1.9473 1.1040 1.1764 2.1138 1.1417 1.0821 1.0427 1.0676 1.0899 8.2677 6.8888 1.0590 1.0450 1.0508 1.0647 1.0597 1.0998 1.1025 1.0583 1.1046 1.1007 1.0999 1.1010 1.1105 1.0892 1.0924 1.0973
irintensity: 0.0553 0.3603 1.0226 0.4595 0.6236 0.7088 0.3952 0.5080 0.7877 2.6927 0.7304 2.7817 0.2109 1.4053 0.0037 1.9410 0.5615 1.1010 0.2732 7.6430 1.3462 3.9573 2.0020 1.0378 8.8182 3.9379 22.4598 15.6436 12.4081 10.9180 11.9467 43.0708 12.5179 34.2007 7.1410 7.2624 1.0000 20.8903 57.9605 16.2930 9.7320 7.9811 3.5725 8.1611 2.4670 4.4600 101.9771 35.4281 32.9423 54.3046 2.6723 58.6324 21.5417 57.1734 56.4116 0.8099 23.8992 52.9192 28.2796 2.9993 60.8576 1.0803 14.2532 69.8884 92.1663 8.9327 57.5107 7.7987 15.5284 15.7120 11.2259 11.9885 86.7567 30.6452 50.4080 133.6359 17.9693 2.3490 12.4903 4.7201 20.4033 40.9605 10.6871 27.7171 31.9712 24.2785 29.7479 63.1232 10.2145 0.5367 37.2614 18.8618 89.2764 49.0405 10.6714 7.7813 1.9553 1.6210 2.1378
temp: 298.150 k
press: 1.00000 atm
elementType: 17 17 16 16 7 7 6 6 6 6 6 6 6 6 6 6 6 6 6 1 1 1 1 1 1 1 1 1 1 1 1 1 1 1 1
symmnumber: 1
zpe: 700451.4 jmol-1
zpe.correction: 0.266788 hartree
zpe.thermalcorrener: 0.287077 hartree
zpe.thermalcorrenthalpy: 0.288021 hartree
zpe.thermalcorrgfe: 0.214610 hartree
zpe.sumelectzpe: -2329.281975 hartree
zpe.sumelectthermal: -2329.261686 hartree
zpe.sumelectthermalent: -2329.260742 hartree
zpe.sumelectthermalfe: -2329.334152 hartree
dipole: 3.3214 2.4516 -4.7823
dipole: 6.3177
quadrupole: -146.9080 -140.9733 -147.8798
quadrupole: 3.6726 -11.5463 11.4346
quadrupole: -1.6543 4.2804 -2.6261 3.6726 -11.5463 11.4346
hfenergy: -2329.5487627 hartree
pointgroup: C01[X(C13H16Cl2N2S2)]
dipole: 1.9081519 0.2939472 -1.5654188 debye
polarizability: 246.2860833|-59.2015259|205.4570133|14.0741419|-1.1749118|196.6773146 unknown
InChI: InChI=1S/C13H16Cl2N2S2/c1-2-3-6-16-8-17(13(18)19-9-16)10-4-5-11(14)12(15)7-10/h4-5,7H,2-3,6,8-9H2,1H3
charge 0 multiplicity 1
35 atoms
Cl -4.049589 0.97886 -2.346208
Cl -3.928612 3.591499 -0.335858
S  1.984335 -2.647591 1.203961
S  -0.293695 -1.357073 2.64187
N  2.345964 -1.298394 -1.295344
N  0.27067 -0.791994 0.00753
C  3.210812 -0.093258 -1.228135
C  0.914195 -1.138116 -1.342403
C  3.321461 0.631041 0.138459
C  2.756006 -2.497106 -0.628184
C  4.337223 1.795477 0.075798
C  -0.75463 0.224433 -0.026871
C  0.56264 -1.485775 1.174631
C  4.457435 2.549763 1.417337
C  -1.785555 0.128373 -0.99108
C  -0.705495 1.346252 0.838703
C  -2.751556 1.150607 -1.094538
C  -1.679078 2.35589 0.734846
C  -2.704133 2.264601 -0.233834
H  2.835916 0.616489 -1.991609
H  4.223148 -0.401847 -1.555406
H  0.460154 -2.08265 -1.700422
H  0.640155 -0.318784 -2.024679
H  3.627022 -0.088228 0.922799
H  2.331484 1.024595 0.438836
H  2.392641 -3.400601 -1.141799
H  3.844845 -2.535365 -0.481061
H  4.037569 2.505163 -0.722766
H  5.332358 1.400269 -0.215619
H  5.196805 3.368759 1.354331
H  3.487505 2.992007 1.712822
H  4.774261 1.867683 2.22812
H  -1.864923 -0.747839 -1.640783
H  0.078121 1.416685 1.596407
H  -1.650258 3.222875 1.400848
