program: Gaussian 09
title: 000210693
version: EM64L-G09RevD.01
frameworkgroup: C1[X(C16H14N2S3)]
method: RPBEPBE
basis: SDD
operation: Freq
keyword: #p
keyword: freq=noraman
keyword: PBEPBE/SDD
title: #p freq=noraman PBEPBE/SDD
converged: YES YES NO NO
title: Mulliken charges:
elementType: S S S N N C C C C C C C C C C C C C C C C H H H H H H H H H H H H H H
charge: 0.081785 0.207648 0.107901 0.050870 -0.021079 -0.600946 0.518968 -0.075522 -0.606900 -0.390853 -0.371585 0.407884 -0.558029 -0.236469 -0.226986 -0.333759 -0.416527 -0.236580 -0.221140 -0.214448 -0.239706 0.261414 0.257553 0.247522 0.229989 0.252221 0.255399 0.229116 0.228876 0.261004 0.232445 0.230734 0.230090 0.228601 0.230507
chargesum: 0.00000
title: Mulliken charges with hydrogens summed into heavy atoms:
elementType: S S S N N C C C C C C C C C C C C C C C C
charge: 0.081785 0.207648 0.107901 0.050870 -0.021079 -0.081979 0.518968 -0.075522 -0.129389 -0.138631 -0.116186 0.407884 -0.558029 -0.007353 0.001890 -0.072756 -0.184081 -0.005846 0.008950 0.014154 -0.009199
polarizability: 3.22538415e+02 -1.59341088e+01 2.38067144e+02 -1.32592882e+01 1.68967949e+00 1.74722910e+02
1716.lowfreq: -8.0548 -6.0078 -3.7947 -0.0026 0.0004 0.0012 12.3722 21.9165 31.4199
frequency: 12.0260 21.8923 31.3176 36.9968 41.4260 58.0675 74.1388 98.9729 132.2294 172.6590 199.1384 208.4711 232.5755 272.6336 309.7310 324.8162 331.8952 343.9244 389.4971 400.5226 403.3232 433.2244 443.9816 477.4018 502.4605 506.5239 535.2709 564.4144 608.9114 614.7692 617.2215 645.5241 700.1240 705.2601 723.4214 745.1676 759.1899 798.0771 818.6258 854.6736 859.6306 903.4051 913.4258 932.3094 944.1775 953.9634 979.1087 983.3247 983.8704 988.9571 990.8110 1000.6672 1001.0454 1025.9193 1027.3243 1048.7804 1084.9244 1086.4664 1146.8733 1173.1974 1173.5647 1189.5417 1190.0894 1197.8824 1210.8732 1229.7663 1234.4623 1310.7839 1327.5264 1338.3466 1354.5687 1375.2228 1384.6768 1392.9503 1440.1689 1442.8392 1452.6406 1461.1500 1482.0998 1483.8231 1590.8403 1593.3327 1609.0668 1612.8384 1615.6031 2951.3315 3017.0929 3027.5535 3097.6702 3116.9856 3123.5226 3126.7392 3129.4070 3137.8018 3141.2886 3148.6116 3151.4459 3164.7701 3165.1278
redmass: 5.2699 4.7790 3.9847 7.6647 8.2810 5.8904 6.5268 16.4282 5.6640 4.9175 5.4383 7.9718 5.5412 3.5212 6.5971 13.6037 9.5577 13.6606 2.3539 2.8216 2.8293 3.7511 4.0633 4.3675 10.0371 7.6382 5.7906 6.6663 5.6189 6.3579 6.1984 6.0735 2.1931 1.7971 3.2782 1.8577 2.0992 3.8866 3.4981 1.2486 1.2443 3.8776 1.4700 1.7965 5.5576 2.0366 1.5618 1.4468 1.6170 6.0759 5.8346 1.3450 1.3519 2.2669 2.2323 5.9176 1.6008 1.5844 3.5722 1.0562 1.0563 1.1130 1.1190 2.3910 2.8498 1.5507 1.4597 1.3047 1.3926 1.2829 1.5041 3.6463 7.0803 2.9478 2.1780 1.9666 1.1659 1.1440 2.0775 2.2318 6.1023 6.0449 6.7294 6.0435 7.3879 1.0652 1.0629 1.0954 1.1000 1.0873 1.0852 1.0864 1.0884 1.0915 1.0926 1.0963 1.0962 1.1016 1.1015
irintensity: 0.0959 0.5155 0.0345 0.2672 1.0307 0.4012 0.3064 1.3010 0.3700 4.4327 1.2694 4.2741 8.2349 2.4793 8.5023 5.4282 8.5072 1.8698 4.1293 0.1667 0.0461 2.5745 0.2439 13.5040 5.7918 5.4619 24.1576 13.0848 7.7209 0.2343 0.1350 23.2833 32.7135 67.7230 44.4412 37.6717 29.5504 3.9155 7.0483 0.5023 0.9183 9.0536 2.2062 6.5246 3.8931 7.3607 0.4085 0.7696 0.3265 1.0004 0.3978 1.5210 0.4619 11.3277 7.2978 50.8784 27.1610 4.6404 86.2309 0.1145 0.1271 3.9932 1.5695 8.1387 6.8309 63.7883 49.7497 4.8562 31.3194 6.7639 66.8813 50.8284 2.7668 76.0273 14.4989 4.8026 43.7664 19.7844 5.2145 17.4343 15.6495 4.6627 72.4447 1.9732 165.8552 44.5704 8.8959 16.9145 2.6199 6.1458 0.3230 0.1251 1.8741 10.5295 12.9895 29.1362 25.2994 23.0743 26.7168
temp: 298.150 k
press: 1.00000 atm
elementType: 16 16 16 7 7 6 6 6 6 6 6 6 6 6 6 6 6 6 6 6 6 1 1 1 1 1 1 1 1 1 1 1 1 1 1
symmnumber: 1
zpe: 684100.6 jmol-1
zpe.correction: 0.260560 hartree
zpe.thermalcorrener: 0.279901 hartree
zpe.thermalcorrenthalpy: 0.280845 hartree
zpe.thermalcorrgfe: 0.208367 hartree
zpe.sumelectzpe: -1920.304380 hartree
zpe.sumelectthermal: -1920.285039 hartree
zpe.sumelectthermalent: -1920.284095 hartree
zpe.sumelectthermalfe: -1920.356573 hartree
dipole: -2.8672 2.2239 0.8898
dipole: 3.7360
quadrupole: -143.1731 -141.9340 -139.4135
quadrupole: 8.0029 0.2375 -5.9843
quadrupole: -1.6663 -0.4271 2.0934 8.0029 0.2375 -5.9843
hfenergy: -1920.5649398 hartree
pointgroup: C01 [X(C16H14N2S3)]
dipole: -1.2302256 0.442033 0.672062 debye
polarizability: 325.9708409|-3.9603097|213.0752338|-6.8441454|29.9193343|196.2823944 unknown
InChI: InChI=1S/C16H14N2S3/c19-16-18(12-14-9-5-2-6-10-14)15(20-21-16)17-11-13-7-3-1-4-8-13/h1-10H,11-12H2
charge 0 multiplicity 1
35 atoms
S  -0.460157 -1.815569 -2.070182
S  1.734036 -1.999595 -2.921137
S  4.17749 -1.313791 -1.43633
N  1.628006 -1.175379 -0.332095
N  -0.497932 -1.308528 0.688605
C  2.187437 -0.671633 0.970358
C  2.005898 0.829705 1.150887
C  0.215315 -1.402671 -0.3847
C  -1.953231 -1.573062 0.67705
C  1.021063 1.330431 2.039133
C  2.835727 1.744966 0.452026
C  -2.771124 -0.614285 -0.192934
C  2.472864 -1.435982 -1.390166
C  0.864278 2.722743 2.225205
C  2.675372 3.13626 0.633597
C  -2.469751 0.772181 -0.231359
C  -3.877049 -1.099958 -0.935028
C  1.689829 3.629352 1.520872
C  -3.263064 1.652919 -0.997243
C  -4.674547 -0.217147 -1.697972
C  -4.369523 1.162562 -1.730943
H  3.257146 -0.948408 0.95443
H  1.666744 -1.23057 1.763745
H  -2.289127 -1.497486 1.72763
H  -2.14499 -2.616173 0.344868
H  0.376304 0.623906 2.573464
H  3.605459 1.363792 -0.229273
H  0.103327 3.098601 2.918459
H  3.321509 3.834476 0.089951
H  -1.607756 1.154511 0.327549
H  -4.111982 -2.171671 -0.920602
H  1.570047 4.709123 1.664663
H  -3.01688 2.720323 -1.025325
H  -5.524638 -0.605825 -2.269731
H  -4.9832 1.847983 -2.326069
