program: Gaussian 09
title: 000210691
version: EM64L-G09RevD.01
frameworkgroup: C1[X(C14H17NO3S2)]
method: RPBEPBE
basis: SDD
operation: Freq
keyword: #p
keyword: freq=noraman
keyword: PBEPBE/SDD
title: #p freq=noraman PBEPBE/SDD
converged: YES YES NO NO
title: Mulliken charges:
elementType: S S O O O N C C C C C C C C C C C C C C H H H H H H H H H H H H H H H H H
charge: 0.332507 0.049648 -0.429890 -0.244586 -0.264272 0.013536 0.311506 -0.764760 -0.562039 -0.668666 -0.559690 0.387621 0.510443 -0.418008 -0.368581 -0.261362 -0.230777 -0.227611 -0.235713 -0.659743 0.325888 0.224749 0.263441 0.242832 0.233632 0.234735 0.392329 0.249937 0.262800 0.238032 0.229872 0.225550 0.226208 0.227697 0.221306 0.236304 0.255129
chargesum: 0.00000
title: Mulliken charges with hydrogens summed into heavy atoms:
elementType: S S O O O N C C C C C C C C C C C C C C
charge: 0.332507 0.049648 -0.037562 -0.244586 -0.264272 0.013536 0.311506 -0.438873 -0.073848 0.042532 -0.559690 0.387621 0.510443 -0.168071 -0.105782 0.206542 -0.005227 -0.001403 -0.008016 0.052996
polarizability: 2.00234737e+02 -1.20202727e+01 1.94394975e+02 5.23914309e+00 1.63254394e+01 1.96957731e+02
1716.lowfreq: -14.3301 -9.0752 -4.6379 0.0012 0.0014 0.0018 17.0751 21.0511 35.7089
frequency: 16.1074 20.1836 35.4753 41.1435 60.9786 76.4163 81.5755 94.0159 154.7881 169.6889 188.5176 198.8747 208.9678 219.7974 225.4324 267.8969 274.4082 303.9338 332.4141 354.3527 363.7012 369.6272 403.1547 425.2479 437.0940 454.3286 500.8351 522.3685 534.6710 593.6267 607.4774 617.3840 637.4859 688.1320 697.3216 707.4000 739.9598 768.2822 777.2162 803.2212 814.2049 820.5256 858.5510 873.9695 905.2604 910.1371 933.0813 962.7708 971.1148 982.1560 990.3110 998.9530 1012.2815 1027.7659 1042.2515 1082.7779 1095.7399 1102.5942 1120.4099 1147.8423 1156.0346 1161.0680 1172.8890 1190.5317 1202.4615 1210.7159 1257.9205 1276.0667 1299.7039 1332.0905 1340.7579 1355.1771 1378.4102 1383.1383 1394.3385 1394.7058 1414.4733 1443.4874 1454.4052 1457.3271 1459.0205 1461.5921 1470.9764 1483.4750 1484.6981 1594.5792 1600.9078 1613.3342 2997.5111 3003.6077 3004.8312 3035.7669 3077.3081 3092.7551 3093.2065 3100.4688 3110.7909 3111.7527 3121.3557 3126.5385 3127.6394 3138.5704 3148.0083 3162.9496 3324.3430
redmass: 4.4722 3.7500 5.5409 3.3480 5.1723 8.6413 5.2686 5.9751 2.2881 4.1051 4.9092 4.8137 1.4075 2.3011 1.6736 6.1448 6.9773 3.1934 6.1246 3.1518 2.7127 7.5075 2.8221 3.8814 4.0482 6.0047 4.6915 7.0995 5.8217 3.7528 6.9133 6.2797 4.6701 1.7430 2.1356 1.7607 2.3739 4.5576 2.9355 1.5043 3.4502 2.5609 1.2520 3.4571 5.9759 2.4794 1.4957 2.2352 2.1855 1.4056 5.7620 1.3290 2.7871 2.2631 2.2213 1.8536 2.1638 2.9476 2.1693 1.3948 1.8225 2.3250 1.0546 1.1518 3.5409 2.7931 1.4678 1.1192 1.7131 1.2689 1.4123 1.3427 1.2780 7.8945 1.2306 1.4730 2.3070 1.8891 1.2590 1.0979 1.1472 1.0462 1.0547 1.0650 2.1534 6.0549 7.2917 6.0162 1.0363 1.0565 1.0399 1.0599 1.1009 1.0863 1.0975 1.1029 1.1015 1.0996 1.0847 1.1067 1.0880 1.0926 1.0967 1.1017 1.0652
irintensity: 0.4325 0.1309 1.1363 0.2880 1.1493 0.5710 1.5213 2.2371 0.1519 0.2515 1.3291 1.9396 1.5692 0.7295 0.3211 2.3877 2.9933 5.3412 14.8180 5.8998 3.8625 6.0387 0.0030 11.7742 3.2650 7.4776 31.9180 5.3875 0.7930 9.6847 13.2222 0.2935 53.3936 156.9409 142.2851 3.5377 22.8067 10.7284 3.8101 2.3934 8.2180 27.9906 2.8769 14.3169 54.4417 23.7028 5.0060 10.4123 15.3424 1.3416 1.1631 1.2228 80.2413 7.5592 39.9201 73.0399 42.4193 77.8263 85.2234 35.1770 40.3659 227.6399 0.1666 5.2227 96.8420 7.9387 59.5243 5.4051 129.8827 4.7007 46.4176 12.9998 63.2529 13.1031 13.4883 78.6646 163.8226 10.7441 25.4512 20.6293 31.4114 13.9782 5.8952 11.4634 23.2407 1.7194 115.2985 5.3232 12.7059 12.3819 18.6467 30.5517 6.4021 0.8521 29.7382 1.5132 9.6659 14.7371 0.7362 26.3229 3.2879 11.7722 27.6715 27.8107 129.1640
temp: 298.150 k
press: 1.00000 atm
elementType: 16 16 8 8 8 7 6 6 6 6 6 6 6 6 6 6 6 6 6 6 1 1 1 1 1 1 1 1 1 1 1 1 1 1 1 1 1
symmnumber: 1
zpe: 752737.6 jmol-1
zpe.correction: 0.286703 hartree
zpe.thermalcorrener: 0.307076 hartree
zpe.thermalcorrenthalpy: 0.308020 hartree
zpe.thermalcorrgfe: 0.234921 hartree
zpe.sumelectzpe: -1618.756714 hartree
zpe.sumelectthermal: -1618.736340 hartree
zpe.sumelectthermalent: -1618.735396 hartree
zpe.sumelectthermalfe: -1618.808496 hartree
dipole: 2.1982 2.8952 2.5962
dipole: 4.4671
quadrupole: -122.1283 -128.6090 -134.0421
quadrupole: 5.1179 0.2129 -12.9427
quadrupole: 6.1315 -0.3492 -5.7823 5.1179 0.2129 -12.9427
hfenergy: -1619.0434165 hartree
pointgroup: C01 [X(C14H17N1O3S2)]
dipole: 0.9497617 -1.4787492 -0.0005265 debye
polarizability: 195.0373231|3.3404213|212.4101459|-15.1630076|-1.6289849|184.1399746 unknown
InChI: InChI=1S/C14H17NO3S2/c1-3-18-12(16)11-14(2,17)15(13(19)20-11)9-10-7-5-4-6-8-10/h4-8,11,17H,3,9H2,1-2H3
charge 0 multiplicity 1
37 atoms
S  2.130016 1.729192 -1.465999
S  -0.388755 3.331132 -0.721782
O  0.034199 -1.716777 -1.797925
O  3.776966 -0.797019 -0.270505
O  1.62691 -1.430601 0.364127
N  -0.305647 0.670198 -1.488745
C  0.51776 -0.413628 -2.165979
C  2.00111 -0.160257 -1.728768
C  -1.778574 0.47981 -1.363544
C  0.374399 -0.309359 -3.693324
C  0.30136 1.861068 -1.211059
C  2.412517 -0.861674 -0.443029
C  -2.216656 -0.162657 -0.048776
C  -2.656095 -1.509895 -0.019788
C  -2.219728 0.5908 1.153962
C  4.331647 -1.356931 1.010755
C  -3.091071 -2.097703 1.189695
C  -2.647747 0.001251 2.363875
C  -3.085855 -1.343706 2.385721
C  4.236053 -0.320583 2.131606
H  2.69643 -0.423327 -2.539842
H  -2.098718 -0.147717 -2.212766
H  -2.223554 1.486876 -1.468643
H  0.898791 -1.1557 -4.167476
H  -0.688632 -0.363271 -3.980302
H  0.797657 0.641139 -4.060063
H  0.222716 -1.854814 -0.820358
H  -2.649076 -2.098247 -0.944882
H  -1.886763 1.634721 1.133407
H  3.773717 -2.277588 1.254939
H  5.373378 -1.596326 0.746939
H  -3.431384 -3.139388 1.199203
H  -2.646055 0.591795 3.28703
H  -3.421734 -1.7985 3.324591
H  4.734511 -0.713475 3.036922
H  4.73424 0.620355 1.843089
H  3.184665 -0.105897 2.384594
