program: Gaussian 09
title: 000210690
version: EM64L-G09RevD.01
frameworkgroup: C1[X(C10H8BrNOS2)]
method: RPBEPBE
basis: SDD
operation: Freq
keyword: #p
keyword: freq=noraman
keyword: PBEPBE/SDD
title: #p freq=noraman PBEPBE/SDD
converged: YES YES NO NO
title: Mulliken charges:
elementType: Br S S O N C C C C C C C C C C H H H H H H H H
charge: 0.015869 0.317824 0.167940 -0.178711 -0.210338 0.509336 0.267746 -0.510854 -0.781595 0.574973 -0.351598 -0.589582 -0.393873 -0.159107 -0.815574 0.271626 0.305787 0.306921 0.256481 0.254804 0.254076 0.256284 0.231568
chargesum: 0.00000
title: Mulliken charges with hydrogens summed into heavy atoms:
elementType: Br S S O N C C C C C C C C C C
charge: 0.015869 0.317824 0.167940 -0.178711 -0.210338 0.509336 0.267746 -0.239228 -0.168888 0.574973 -0.095117 -0.589582 -0.393873 0.095697 -0.073647
polarizability: 2.43960970e+02 1.13271158e+01 1.63772028e+02 -4.87580001e+00 6.75954939e-01 1.02470429e+02
1716.lowfreq: -8.5467 -4.9028 0.0014 0.0018 0.0018 1.3586 29.9100 41.1471 52.7483
frequency: 29.6690 41.1037 52.7455 104.0548 112.5454 129.4322 141.9160 172.4332 202.3741 219.9765 267.0083 296.1898 344.4213 384.3991 395.3871 442.3309 453.9012 504.4201 515.3564 522.3185 534.2608 570.3524 606.8174 660.6796 708.2116 724.4723 746.7510 814.0702 864.1745 889.0316 897.6010 948.9109 966.8204 999.3920 1010.0986 1024.7729 1048.3845 1118.3780 1139.2712 1146.3890 1209.7809 1220.6362 1233.5272 1264.9203 1310.1679 1370.3548 1401.0552 1406.1615 1421.4888 1454.0189 1463.2240 1479.1434 1581.5377 1606.7966 1646.1318 2985.7821 3049.0982 3064.9727 3097.3214 3121.2040 3157.0138 3162.4036 3181.4605
redmass: 5.0692 10.7543 13.3876 7.3722 3.4497 5.8616 1.0529 16.3375 4.8519 3.3911 15.6086 5.2922 6.3733 8.1102 19.0322 2.9057 3.9780 14.4933 6.7058 4.6422 5.5448 4.6501 4.4477 6.6996 4.5948 4.3594 6.1522 1.4323 3.2300 1.6419 1.6488 1.5045 3.0804 2.5905 4.3608 3.4379 1.5351 1.1615 1.4706 2.4132 3.2105 2.9227 1.6618 1.4700 4.4981 7.5606 3.1946 1.2536 1.0794 2.3026 1.0439 1.2711 6.7550 7.1554 12.5672 1.0373 1.0570 1.0973 1.0996 1.1067 1.0927 1.0889 1.0980
irintensity: 0.2534 0.5595 1.5116 5.9633 3.1975 1.4948 0.3082 0.6694 0.7861 1.6900 2.0959 4.8436 1.9188 17.7468 2.7231 5.9140 4.1414 1.8389 6.5695 5.1910 4.8047 19.4692 1.1741 5.7268 5.5510 0.9456 54.1484 16.2242 11.2825 4.5067 15.2895 3.1582 13.7287 41.4477 55.5627 49.4550 6.2480 0.2543 3.6328 40.3991 207.2600 251.0023 99.8698 16.5783 92.8476 8.4324 13.0561 21.8292 14.1020 53.5662 12.4936 70.2691 4.1506 9.6036 225.8339 15.3800 3.9680 9.6656 16.3035 0.0157 2.9505 2.0504 2.0766
temp: 298.150 k
press: 1.00000 atm
elementType: 35 16 16 8 7 6 6 6 6 6 6 6 6 6 6 1 1 1 1 1 1 1 1
symmnumber: 1
zpe: 410552.5 jmol-1
zpe.correction: 0.156371 hartree
zpe.thermalcorrener: 0.170931 hartree
zpe.thermalcorrenthalpy: 0.171875 hartree
zpe.thermalcorrgfe: 0.112157 hartree
zpe.sumelectzpe: -1324.368721 hartree
zpe.sumelectthermal: -1324.354161 hartree
zpe.sumelectthermalent: -1324.353217 hartree
zpe.sumelectthermalfe: -1324.412935 hartree
dipole: -1.2879 -0.9445 0.9420
dipole: 1.8543
quadrupole: -104.5206 -118.4810 -107.6518
quadrupole: 11.1678 -1.9930 9.3459
quadrupole: 5.6972 -8.2632 2.5660 11.1678 -1.9930 9.3459
hfenergy: -1324.5250925 hartree
pointgroup: C01 [X(C10H8Br1N1O1S2)]
dipole: -0.5411739 0.2130923 -0.440373 debye
dipolederiv: -0.7774147 -0.090325 -0.0150132 -0.0839649 -0.0575255 -0.014995 -0.0303338 -0.0131671 -0.0369954 -0.6326829 0.1381726 -0.1389812 0.077663 -0.0191178 0.0435807 -0.1457494 0.0353403 -0.0172848 -0.4061563 0.2001585 -0.1688798 0.1963433 -0.5243363 0.3196379 -0.1141944 0.3056065 -0.3015001 -0.4811286 -0.2568016 0.1716677 0.028381 -0.9448707 0.422901 -0.0697358 0.383216 -0.5364272 -0.9083979 0.1245709 -0.1261908 -0.1753329 -1.2203684 0.7141132 0.0371069 0.7116736 -0.5036138 0.7038584 0.1069722 -0.0565356 0.0270285 0.0722125 0.123778 0.0109509 0.0684251 0.0954695 0.8159573 -0.1464511 0.1301978 -0.377187 1.2693072 -0.7272681 0.2376095 -0.6694197 0.6374812 -0.0555944 0.1604561 0.091053 -0.0364388 -0.0602826 0.016858 -0.1040136 -0.03235 -0.0920466 -0.4796364 -0.0467553 -0.0159249 0.0782892 0.1652394 -0.0317696 -0.0527766 -0.049666 0.125534 -0.2791221 -0.3321962 -0.1685626 -0.2024788 0.1301974 0.0686463 -0.1137459 0.053855 0.0749843 -0.0313157 -0.07787 -0.0233416 0.0752779 -0.0208744 0.0226943 0.1226861 0.0191416 -0.092313 1.2599507 -0.041666 0.1507096 0.0985142 1.0621309 -0.8620829 0.1285164 -0.7815681 0.3687997 1.3491544 0.1935397 0.0567622 0.2030235 -0.0331871 0.055943 0.0787668 0.0656107 -0.1224317 -0.4121676 0.067256 0.0555612 -0.0123099 0.0033385 0.0426307 0.0101334 0.0356332 -0.0555155 -0.0650169 0.1301795 0.0855981 0.1017482 -0.0065902 -0.03049 0.0624585 -0.0343253 0.0290025 0.0520529 -0.04318 -0.0300699 -0.06608 0.018369 -0.0623036 -0.0441858 -0.0370517 0.093261 0.0960378 0.0010761 0.0328008 0.0525424 -0.0336065 0.0058192 0.033857 -0.0055875 0.0749852 0.1179089 -0.0296512 -0.0037043 0.0038308 0.051006 0.0398136 -0.0540702 0.0397202 -0.0180206 0.018816 0.0662234 0.036529 0.0646686 0.0588277 -0.0631739 0.0380512 -0.0290544 0.1065488 0.0495688 -0.0516968 -0.0268417 -0.0483873 0.0271433 -0.0731755 -0.0268236 -0.069517 0.1132767 0.0299752 -0.0073478 0.0996798 -0.0292772 0.0390242 0.0544636 0.1036462 0.0110128 -0.0086061 0.0274246 0.0766555 -0.053171 0.0749982 0.0375159 0.0066658 -0.0768175 0.0533439 0.0008588 0.0079286 -0.1413196 -0.0833427 -0.050852 -0.0135524 -0.0722866 -0.0313362 -0.0608722 0.0645532 unknown
polarizability: 245.4131446|-2.0318591|158.8544584|5.2484443|-14.0604098|105.9358245 unknown
InChI: InChI=1S/C10H8BrNOS2/c1-6-4-7(2-3-8(6)11)12-9(13)5-15-10(12)14/h2-4H,5H2,1H3
charge 0 multiplicity 1
23 atoms
Br 4.773478 0.557412 0.292108
S  -3.900351 -0.838481 0.500246
S  -1.443094 -2.282836 1.648159
O  -1.681475 2.06898 -1.064791
N  -1.409679 0.057307 0.156984
C  0.038835 0.162245 0.195006
C  -2.175684 1.065263 -0.505264
C  0.825875 -0.832819 -0.419973
C  -3.671877 0.771347 -0.452108
C  2.240985 -0.759289 -0.413563
C  0.636657 1.270747 0.827484
C  -2.098745 -1.012805 0.76999
C  2.818055 0.366005 0.23206
C  2.042859 1.372227 0.842464
C  3.067802 -1.842515 -1.072106
H  0.339699 -1.684076 -0.905966
H  -4.197471 1.591559 0.061458
H  -4.066334 0.666411 -1.474784
H  0.02324 2.045881 1.2947
H  2.527383 2.224573 1.325872
H  3.706042 -1.42821 -1.874106
H  3.745838 -2.324125 -0.343791
H  2.422362 -2.621702 -1.509679
