program: Gaussian 09
title: 000210689
version: EM64L-G09RevD.01
frameworkgroup: C1[X(C14H17NOS2)]
method: RPBEPBE
basis: SDD
operation: Freq
keyword: #p
keyword: freq=noraman
keyword: PBEPBE/SDD
title: #p freq=noraman PBEPBE/SDD
converged: YES YES NO NO
title: Mulliken charges:
elementType: S S O N C C C C C C C C C C C C C C H H H H H H H H H H H H H H H H H
charge: 0.318082 0.106070 -0.217221 -0.002044 -0.626401 -0.359808 -0.326921 0.307726 -0.348040 -0.601649 -0.559299 0.504741 -0.694708 -0.384085 -0.377982 -0.228280 -0.237364 -0.233493 0.319258 0.234441 0.225348 0.215581 0.206372 0.196394 0.193273 0.258649 0.255887 0.213197 0.215994 0.216240 0.256968 0.265390 0.228589 0.228626 0.230470
chargesum: 0.00000
title: Mulliken charges with hydrogens summed into heavy atoms:
elementType: S S O N C C C C C C C C C C C C C C
charge: 0.318082 0.106070 -0.217221 -0.002044 -0.307143 0.099981 0.095031 0.307726 0.041627 -0.087112 -0.559299 0.504741 -0.049278 -0.127117 -0.112592 0.000309 -0.008737 -0.003023
polarizability: 1.92433397e+02 3.10309850e+00 1.94286385e+02 -1.88062526e+01 3.30218087e+01 1.71803613e+02
1716.lowfreq: -9.3813 -0.0014 0.0003 0.0013 1.9051 10.6366 14.8340 26.9177 37.8306
frequency: 14.7973 26.6979 37.7935 44.8018 60.4091 69.9302 97.7533 119.4052 134.0616 186.6367 201.0610 222.6678 223.9068 248.2724 271.2063 314.4323 376.4289 381.8250 398.9748 405.2833 433.1293 473.5579 494.6060 509.8355 531.2657 557.2797 617.6406 642.1218 671.6451 707.0675 729.7882 741.6883 757.6134 780.4988 819.8940 827.6417 861.7788 899.1638 907.8244 930.7881 940.9184 945.5064 985.8986 990.1087 998.5096 1001.1920 1027.7191 1040.6206 1061.9526 1086.1761 1094.0298 1099.3031 1117.4198 1173.5043 1176.4459 1191.0334 1195.2219 1210.1149 1212.5340 1230.1951 1263.7205 1281.3088 1289.3476 1296.8135 1317.3808 1337.6441 1346.8796 1362.1129 1368.4309 1385.5418 1391.8015 1444.4674 1448.1408 1452.4186 1466.9299 1475.6141 1477.4372 1484.2469 1486.9999 1593.9006 1613.1144 1623.3644 2964.1576 2973.5537 2975.0995 2984.6766 3006.1019 3029.0048 3031.3000 3050.7506 3052.2763 3071.9452 3074.6513 3095.9870 3124.7697 3131.8867 3142.5130 3151.6383 3165.4036
redmass: 4.4739 4.0593 6.0190 1.5196 4.8731 6.1365 5.9098 4.6897 3.0448 4.5076 5.4451 1.5827 2.5575 2.8829 5.3109 7.7787 2.6480 2.5990 7.1147 2.8554 4.9596 5.0025 6.8471 8.6583 8.1974 5.3573 6.2691 4.7060 3.2413 1.7986 1.1580 4.9297 2.1453 1.5498 3.1507 2.4138 1.2437 2.2607 2.6199 1.3523 1.5111 2.6502 1.3940 5.6798 2.9681 1.3359 2.2707 4.0571 2.6341 1.6879 2.4738 2.0698 1.5807 1.0926 1.3948 1.1292 1.9172 2.6177 1.4966 1.4619 4.2300 1.2455 1.2729 1.0774 1.7196 1.4057 1.4953 1.5542 1.4200 5.8138 1.2143 2.0656 1.0846 1.1420 1.0698 1.0699 1.0425 2.2137 1.0780 6.0718 6.0174 11.0375 1.0588 1.0579 1.0383 1.0597 1.0988 1.1016 1.0585 1.0852 1.1033 1.1008 1.0994 1.1053 1.0848 1.0881 1.0927 1.0967 1.1017
irintensity: 0.2614 0.0766 0.1526 0.0117 0.1112 0.2429 1.9765 3.7255 0.1487 1.6345 0.9039 0.3920 0.6953 0.2416 5.6976 0.4207 2.9303 1.7518 4.3714 0.0694 5.7732 8.6141 15.8866 10.3880 9.3703 9.7198 0.0443 33.7505 1.4944 74.0420 12.3458 6.2268 17.9264 5.9822 6.9765 2.5105 1.6882 21.0170 5.8833 0.3213 14.6565 16.9426 1.7007 0.5861 20.1068 0.6623 7.9525 17.4956 3.8571 50.6695 0.9903 9.9599 10.6310 7.7493 26.8534 3.3662 165.5539 6.1842 22.9462 31.0223 129.1463 4.5447 11.7516 4.2957 119.4865 0.4639 68.6361 3.3940 27.8326 10.0648 10.2714 9.5740 10.3630 36.9048 0.8140 4.5151 12.1803 16.7616 15.1948 4.5013 1.6650 169.0888 17.2046 14.3407 27.9597 56.5963 5.1077 4.6461 15.3328 6.7768 17.9012 70.3499 53.1481 0.5804 0.1750 3.5507 12.0125 20.9146 22.1284
temp: 298.150 k
press: 1.00000 atm
elementType: 16 16 8 7 6 6 6 6 6 6 6 6 6 6 6 6 6 6 1 1 1 1 1 1 1 1 1 1 1 1 1 1 1 1 1
symmnumber: 1
zpe: 734165.6 jmol-1
zpe.correction: 0.279629 hartree
zpe.thermalcorrener: 0.297826 hartree
zpe.thermalcorrenthalpy: 0.298770 hartree
zpe.thermalcorrgfe: 0.230080 hartree
zpe.sumelectzpe: -1468.478557 hartree
zpe.sumelectthermal: -1468.460360 hartree
zpe.sumelectthermalent: -1468.459416 hartree
zpe.sumelectthermalfe: -1468.528106 hartree
dipole: -0.3779 2.3698 0.6929
dipole: 2.4978
quadrupole: -113.1363 -123.8590 -127.5318
quadrupole: -1.4509 -5.1663 -5.7202
quadrupole: 8.3728 -2.3500 -6.0228 -1.4509 -5.1663 -5.7202
hfenergy: -1468.7581862 hartree
pointgroup: C01 [X(C14H17N1O1S2)]
dipole: 0.315844 -0.8416541 0.3969745 debye
polarizability: 191.6722748|5.9085867|186.4780781|23.7300546|-31.2966363|180.3730417 unknown
InChI: InChI=1S/C14H17NOS2/c1-2-3-9-12-13(16)15(14(17)18-12)10-11-7-5-4-6-8-11/h4-8,12H,2-3,9-10H2,1H3
charge 0 multiplicity 1
35 atoms
S  2.488885 1.920775 -1.033677
S  -0.206626 3.002738 -2.061736
O  0.838096 0.656652 2.355767
N  0.219291 1.686984 0.331962
C  2.566411 1.022294 0.644748
C  3.071179 -0.438406 0.540676
C  2.185811 -1.369608 -0.315173
C  1.149418 1.09443 1.219191
C  2.746221 -2.808808 -0.381792
C  -1.224473 1.742395 0.721243
C  0.693022 2.20409 -0.882021
C  -1.980441 0.466446 0.365587
C  1.86015 -3.749275 -1.226522
C  -2.647718 0.350174 -0.88061
C  -2.035011 -0.613371 1.284626
C  -3.352012 -0.830582 -1.206396
C  -2.739954 -1.793476 0.958068
C  -3.399491 -1.905511 -0.288424
H  3.237636 1.612762 1.292139
H  3.126988 -0.827202 1.577457
H  4.105071 -0.425991 0.144394
H  1.160186 -1.403127 0.105054
H  2.096983 -0.961558 -1.341386
H  2.841439 -3.213102 0.646585
H  3.771402 -2.78439 -0.805022
H  -1.649765 2.617219 0.201708
H  -1.233919 1.911404 1.811629
H  1.778009 -3.387026 -2.268442
H  0.836419 -3.806594 -0.811313
H  2.272781 -4.774292 -1.255651
H  -2.606428 1.183141 -1.591592
H  -1.520165 -0.52436 2.248076
H  -3.865392 -0.9102 -2.17113
H  -2.779574 -2.62063 1.675683
H  -3.949232 -2.819595 -0.53991
