program: Gaussian 09
title: 000210688
version: EM64L-G09RevD.01
frameworkgroup: C1[X(C13H15NOS2)]
method: RPBEPBE
basis: SDD
operation: Freq
keyword: #p
keyword: freq=noraman
keyword: PBEPBE/SDD
title: #p freq=noraman PBEPBE/SDD
converged: YES YES NO NO
title: Mulliken charges:
elementType: S S O N C C C C C C C C C C C C C H H H H H H H H H H H H H H H
charge: 0.312537 0.108802 -0.216555 -0.014712 -0.626844 -0.312842 0.323853 -0.340503 -0.596803 -0.548156 0.507342 -0.692176 -0.373515 -0.385436 -0.235052 -0.228580 -0.233095 0.305972 0.225049 0.239044 0.197372 0.211941 0.254444 0.258073 0.213631 0.216371 0.223345 0.264367 0.256281 0.227740 0.228150 0.229956
chargesum: 0.00000
title: Mulliken charges with hydrogens summed into heavy atoms:
elementType: S S O N C C C C C C C C C C C C C
charge: 0.312537 0.108802 -0.216555 -0.014712 -0.320873 0.151251 0.323853 0.068810 -0.084285 -0.548156 0.507342 -0.038830 -0.109147 -0.129154 -0.007312 -0.000431 -0.003139
polarizability: 2.22914996e+02 1.73928383e+01 2.03956019e+02 -5.41247781e+00 6.28825459e-01 1.16715812e+02
1716.lowfreq: -15.8778 -7.3014 -0.0004 0.0014 0.0020 5.7786 15.3376 31.7927 43.5522
frequency: 13.7290 31.6310 43.4295 62.4955 74.0868 81.4493 94.6741 138.1831 192.8263 202.6099 229.6908 246.2234 256.3298 298.5536 314.5220 380.7682 398.6222 406.1493 409.9992 438.4562 495.6023 514.6893 527.7083 602.1465 616.2140 617.3757 671.3630 704.9828 712.5134 749.9001 759.7170 820.4187 837.1370 862.1188 878.6834 903.6853 913.9755 941.8538 986.6756 987.5812 990.5998 1001.5677 1024.9600 1028.0627 1057.4796 1070.8426 1087.3682 1091.3736 1112.6755 1173.8907 1186.0243 1192.4220 1197.1391 1212.4211 1221.9994 1258.6270 1264.5576 1288.6945 1308.2517 1319.2883 1347.7088 1350.2827 1370.8184 1386.0576 1391.1831 1444.6006 1452.6041 1453.5806 1471.3488 1477.7631 1484.5281 1484.8239 1594.1334 1613.4882 1622.0035 2968.1784 2978.4073 2984.5288 3013.6615 3031.1476 3031.4610 3053.2260 3075.3444 3080.5167 3095.5910 3125.4094 3133.0043 3143.7304 3152.8075 3166.1816
redmass: 4.4844 5.2041 4.5580 4.4305 2.2708 3.4363 6.4221 3.8538 5.6003 5.6601 1.2251 4.7312 3.8034 4.2486 9.0564 2.2519 5.4326 2.8929 4.1849 4.6711 8.5293 6.8641 9.1759 5.0011 4.5747 6.1387 3.2602 2.5108 2.6215 1.3041 1.9997 3.6005 3.7451 1.2435 1.3125 1.8330 3.0986 1.5099 1.4163 3.0612 5.4186 1.3359 3.8630 2.2814 1.7018 3.4024 1.6800 2.3598 2.0015 1.0613 1.4889 1.1463 1.9259 2.7465 1.3993 1.5577 2.8291 1.1358 1.2541 1.7300 1.4741 1.5340 1.4379 5.6403 1.2081 2.0853 1.1382 1.0751 1.0652 1.0423 2.2049 1.0705 6.0600 5.9883 11.5623 1.0592 1.0365 1.0588 1.0995 1.0586 1.0865 1.1014 1.1010 1.0993 1.1052 1.0848 1.0881 1.0927 1.0967 1.1017
irintensity: 0.4810 0.0721 0.3032 0.0855 0.2544 0.3721 1.1293 4.6162 0.7543 1.1063 0.2751 1.1371 3.2556 6.3389 3.8796 2.8237 2.0148 0.0581 5.7196 2.2208 15.5579 17.5944 7.8542 13.8283 24.3299 0.5510 1.8369 19.4409 64.3808 16.8784 21.7773 3.2096 10.5723 1.1430 1.4009 8.4484 14.9720 12.9716 0.6274 23.0724 0.0470 1.6071 26.0482 6.4848 6.8174 14.3627 37.7637 6.9911 20.3152 2.5477 22.9416 3.7807 215.6743 9.3297 15.4679 62.0695 134.0867 4.8003 1.0501 123.3290 62.7217 3.9766 30.3275 12.0304 11.9184 7.3396 35.4876 3.5703 4.3871 14.1916 19.4724 14.9376 4.8077 1.7990 176.6653 20.1134 30.9124 26.9324 6.4936 14.4901 1.2414 11.3985 63.5384 41.0796 0.5903 0.1458 4.0679 13.9999 21.3089 23.6758
temp: 298.150 k
press: 1.00000 atm
elementType: 16 16 8 7 6 6 6 6 6 6 6 6 6 6 6 6 6 1 1 1 1 1 1 1 1 1 1 1 1 1 1 1
symmnumber: 1
zpe: 660847.9 jmol-1
zpe.correction: 0.251704 hartree
zpe.thermalcorrener: 0.268551 hartree
zpe.thermalcorrenthalpy: 0.269495 hartree
zpe.thermalcorrgfe: 0.204117 hartree
zpe.sumelectzpe: -1429.256061 hartree
zpe.sumelectthermal: -1429.239213 hartree
zpe.sumelectthermalent: -1429.238269 hartree
zpe.sumelectthermalfe: -1429.303647 hartree
dipole: -1.2018 -1.9693 -0.3913
dipole: 2.3400
quadrupole: -100.4261 -124.9431 -114.6564
quadrupole: 2.1795 -1.9015 3.8518
quadrupole: 12.9158 -11.6013 -1.3145 2.1795 -1.9015 3.8518
hfenergy: -1429.5077643 hartree
pointgroup: C01 [X(C13H15N1O1S2)]
dipole: -0.4709576 0.764815 0.2019887 debye
polarizability: 223.0500673|-17.5689213|203.5953664|3.0538794|5.5881398|116.9413933 unknown
InChI: InChI=1S/C13H15NOS2/c1-2-6-11-12(15)14(13(16)17-11)9-10-7-4-3-5-8-10/h3-5,7-8,11H,2,6,9H2,1H3
charge 0 multiplicity 1
32 atoms
S  -2.115061 -1.699695 0.788562
S  0.211511 -3.26237 -0.486523
O  -0.776206 1.747072 -0.683079
N  -0.186528 -0.530315 -0.6217
C  -2.231337 0.186294 0.539396
C  -3.558249 0.62011 -0.11901
C  -1.012126 0.572794 -0.300173
C  -4.789518 0.378802 0.780803
C  1.0591 -0.299842 -1.420115
C  -0.573536 -1.803717 -0.18258
C  2.256619 0.084433 -0.557823
C  -6.097065 0.855836 0.11456
C  2.501718 1.445742 -0.241255
C  3.148252 -0.909935 -0.080802
C  3.617913 1.805032 0.546353
C  4.263738 -0.549368 0.707817
C  4.501386 0.80862 1.023231
H  -2.129622 0.650388 1.537427
H  -3.680662 0.087963 -1.082103
H  -3.468175 1.700081 -0.351543
H  -4.647172 0.908879 1.744628
H  -4.868989 -0.700534 1.021085
H  0.813361 0.509716 -2.128713
H  1.247087 -1.236551 -1.970887
H  -6.054745 1.936392 -0.117292
H  -6.281995 0.315064 -0.832174
H  -6.966289 0.685908 0.774799
H  1.811523 2.214199 -0.607524
H  2.959723 -1.96189 -0.323215
H  3.800329 2.858934 0.784205
H  4.947132 -1.324506 1.072016
H  5.368582 1.088162 1.632128
