program: Gaussian 09
title: 000216124
version: EM64L-G09RevD.01
frameworkgroup: C1[X(C24H29NO2)]
method: RPBEPBE
basis: SDD
operation: Freq
keyword: #p
keyword: freq=noraman
keyword: PBEPBE/SDD
title: #p freq=noraman PBEPBE/SDD
converged: YES YES NO NO
title: Mulliken charges:
elementType: O O N C C C C C C C C C C C C C C C C C C C C C C C C H H H H H H H H H H H H H H H H H H H H H H H H H H H H H
charge: -0.274829 -0.241101 -0.078383 0.018420 -0.357891 -0.604545 0.485579 0.487228 0.233874 -0.402887 -0.414211 -0.421533 -0.427923 -0.012310 -0.319704 -0.339965 -0.410662 -0.405814 -0.384477 -0.387237 -0.230220 -0.226979 -0.231221 -0.238288 -0.241976 -0.239849 -0.728405 0.287706 0.268725 0.249473 0.228411 0.234254 0.233253 0.248743 0.191419 0.237083 0.236059 0.222624 0.213059 0.199384 0.191532 0.189884 0.198176 0.221162 0.178289 0.170135 0.209933 0.223513 0.225282 0.223191 0.226370 0.226340 0.228791 0.209223 0.212161 0.211139
chargesum: 0.00000
title: Mulliken charges with hydrogens summed into heavy atoms:
elementType: O O N C C C C C C C C C C C C C C C C C C C C C C C C
charge: -0.274829 -0.241101 -0.078383 0.018420 -0.070185 -0.086348 0.485579 0.487228 0.233874 -0.174476 -0.179957 -0.188280 -0.179181 0.179110 0.153438 0.095718 -0.019747 -0.017755 0.014973 -0.007168 -0.006707 -0.001697 -0.008031 -0.011918 -0.015637 -0.011058 -0.095882
polarizability: 3.13319216e+02 -1.54454963e+01 2.60965805e+02 1.27576857e+01 1.60558210e+01 2.20779151e+02
1716.lowfreq: -16.7686 -2.1061 -0.0011 -0.0007 0.0010 3.9262 9.5470 15.8644 20.3311
frequency: -12.3318 15.5763 19.8285 21.7939 35.4218 36.4742 46.0111 55.5656 73.2515 84.7258 97.0779 156.0741 158.6562 170.9778 203.4833 220.8006 234.3885 241.5353 255.0540 263.0179 273.2109 288.8441 311.6707 349.7322 355.2147 364.6648 383.2643 396.9467 401.2009 403.8620 436.7769 466.8166 474.6396 486.6390 548.1747 560.4051 588.2395 608.5299 615.2460 617.4437 649.8278 678.1197 699.0804 707.8794 728.1078 753.6437 756.3029 776.6194 783.2055 797.0816 804.8631 826.1522 829.0964 847.8652 854.5425 871.7288 887.8319 897.7015 919.1129 926.6597 949.9281 964.1574 973.1652 974.1856 977.5928 980.0517 987.4573 990.6699 992.9888 993.6365 996.9761 1000.7922 1021.2392 1023.7201 1027.1398 1062.4506 1066.7096 1080.1378 1081.8814 1085.0102 1095.6262 1103.6054 1106.1768 1111.8549 1128.6245 1134.8361 1143.8097 1146.7866 1162.5879 1172.1278 1172.5168 1185.7085 1189.9080 1190.6572 1224.7014 1260.2566 1265.1780 1268.9790 1276.4394 1294.5398 1305.0070 1307.1085 1309.5727 1312.3948 1317.9863 1319.1642 1337.4280 1348.8874 1358.0221 1369.5189 1373.1575 1377.7106 1385.4242 1386.6210 1396.0712 1432.3336 1435.6418 1446.0001 1450.9585 1458.1429 1458.5518 1464.5714 1474.0400 1475.4886 1476.5632 1482.1758 1482.8758 1485.2901 1587.8249 1590.6208 1609.9402 1613.3653 1633.4737 2825.0226 2836.3517 2905.3221 2942.1077 2965.6967 2975.2319 2979.7938 3023.5809 3035.4903 3036.6938 3038.1559 3041.9394 3043.3508 3062.3102 3064.3050 3102.4020 3119.2010 3120.1601 3122.9999 3124.4288 3125.1608 3135.4188 3136.4187 3145.6798 3146.3580 3162.4767 3162.8337 3163.2123 3208.1327
redmass: 4.5028 4.9324 3.4386 3.3191 3.8167 4.3774 4.8690 4.8835 5.3513 5.4931 3.5574 4.0842 4.5736 3.7904 1.0713 3.6839 1.9296 3.4591 3.5408 2.7736 3.5898 3.3165 3.6208 2.8886 2.7283 3.5323 3.9795 3.3480 2.8261 2.8344 1.9153 3.8151 2.7945 4.1333 3.3096 4.4310 4.2893 2.5140 6.4271 5.8246 3.6434 5.8946 1.8191 1.6327 4.6361 3.5842 1.9230 2.0059 1.5178 2.2685 1.5517 2.0551 2.3037 1.2654 1.2891 5.0758 2.2790 3.5382 1.4350 1.5532 1.3200 1.3445 1.4121 1.9794 1.4776 1.7948 2.9292 5.5392 3.2254 1.3447 1.4753 2.0115 2.4319 3.0529 2.3106 1.9003 2.4484 1.5767 1.5328 1.9022 2.3745 1.5267 2.2078 2.5569 1.7451 1.8146 1.9186 1.4284 2.4114 1.0522 1.0516 1.1105 1.1519 1.5693 1.2934 1.3638 1.4348 2.5741 1.3476 1.1878 2.6795 1.3462 1.2682 1.4064 1.3381 1.3481 1.4301 1.3792 1.6379 1.5882 4.1044 6.2194 1.7564 1.3808 1.5662 2.2125 2.2191 1.0911 1.0971 1.0927 1.2478 1.0802 1.0570 1.0756 1.0588 1.0944 2.3632 2.3728 6.1121 6.1846 6.1299 6.1333 9.5582 1.0715 1.0704 1.0689 1.0822 1.0361 1.0592 1.0600 1.0876 1.0811 1.0943 1.0902 1.0953 1.0812 1.0992 1.0993 1.0557 1.0849 1.0847 1.0874 1.0874 1.1077 1.0918 1.0920 1.0964 1.0964 1.1015 1.0978 1.0936 1.1161
irintensity: 0.0614 0.2325 0.0858 0.1938 0.0600 0.1850 0.2114 0.5288 0.3442 1.0945 0.3678 1.1471 0.5862 0.4439 0.0589 1.7887 0.4934 0.4722 0.5603 4.0881 0.3701 10.6691 2.8332 1.9363 12.9315 2.7753 9.7553 5.9062 0.0655 0.2729 0.3737 1.4626 0.3669 4.0146 34.3340 0.3576 10.8637 0.9151 0.0593 0.3227 4.6503 1.8068 31.2252 83.7070 10.2459 2.8768 34.6215 25.0547 12.6098 5.3076 0.2855 4.0914 5.0385 0.3827 1.8585 49.7740 7.8539 45.3386 0.7430 2.9241 1.8327 7.5472 1.1795 26.5617 5.4477 13.9026 0.4242 0.7691 2.5787 0.0464 0.4814 14.6500 14.7871 0.5653 3.0819 35.4188 2.5917 1.9080 13.0699 29.7606 76.4896 45.7100 215.6003 14.8081 126.5317 0.5105 67.7726 3.3534 16.8060 0.0666 0.0296 0.6649 0.8042 1.8636 1.1568 6.3039 7.2795 40.0077 7.9149 6.5244 10.9065 1.2540 1.3126 0.2556 12.6464 2.9539 0.3098 3.9898 7.5722 6.6241 13.3025 7.5660 43.8702 60.8317 39.7968 0.6612 11.2774 3.3462 14.5317 8.7942 26.7974 0.4104 11.1750 14.7370 6.3962 11.5812 17.3678 14.0552 2.0253 2.6278 12.7729 5.2624 123.0538 61.0956 121.1350 73.4860 23.7344 33.4266 41.1992 52.9679 43.1402 44.9099 10.0775 5.6185 42.0432 49.9521 82.8598 43.4486 6.9710 6.5662 4.1614 0.1055 0.0229 14.5405 21.8900 10.7988 3.9671 70.8094 31.9818 11.7689 9.2687 5.9156
temp: 298.150 k
press: 1.00000 atm
elementType: 8 8 7 6 6 6 6 6 6 6 6 6 6 6 6 6 6 6 6 6 6 6 6 6 6 6 6 1 1 1 1 1 1 1 1 1 1 1 1 1 1 1 1 1 1 1 1 1 1 1 1 1 1 1 1 1
symmnumber: 1
zpe: 1239293.2 jmol-1
zpe.correction: 0.472022 hartree
zpe.thermalcorrener: 0.496711 hartree
zpe.thermalcorrenthalpy: 0.497655 hartree
zpe.thermalcorrgfe: 0.414033 hartree
zpe.sumelectzpe: -1135.126537 hartree
zpe.sumelectthermal: -1135.101848 hartree
zpe.sumelectthermalent: -1135.100904 hartree
zpe.sumelectthermalfe: -1135.184526 hartree
dipole: 0.0386 -1.0685 0.0505
dipole: 1.0704
quadrupole: -146.1570 -154.4023 -154.9293
quadrupole: 0.3729 1.7025 1.2550
quadrupole: 5.6725 -2.5728 -3.0997 0.3729 1.7025 1.2550
hfenergy: -1135.598559 hartree
pointgroup: C01 [X(C24H29N1O2)]
dipole: -0.0098162 -0.3454712 -0.240643 debye
polarizability: 311.6536846|-22.0185763|232.1489237|-1.3187305|24.5673539|251.2615643 unknown
InChI: InChI=1S/C24H29NO2/c1-19-12-14-25(15-13-19)16-17-27-23(26)22-18-24(22,20-8-4-2-5-9-20)21-10-6-3-7-11-21/h2-11,19,22H,12-18H2,1H3
charge 0 multiplicity 1
56 atoms
O  -0.710985 -0.802004 -1.021623
O  -0.377157 -0.231824 1.224081
N  -4.43517 -0.483324 -0.409493
C  2.674443 -0.732036 0.279301
C  1.328888 -1.476844 -0.023321
C  2.167074 -1.820953 1.218567
C  2.650307 0.718814 0.724832
C  3.835817 -1.068367 -0.642267
C  0.02808 -0.781184 0.171729
C  2.354231 1.74043 -0.213491
C  5.120185 -1.300655 -0.087009
C  2.981489 1.084699 2.051345
C  3.683044 -1.103194 -2.050498
C  -7.158385 0.217457 0.514477
C  -2.053275 -0.150636 -0.974921
C  -3.12173 -1.158016 -0.508348
C  -5.91141 1.062681 0.874464
C  -6.891558 -0.537266 -0.811986
C  -4.634893 0.199883 0.895183
C  -5.586895 -1.356782 -0.74496
C  2.381605 3.098003 0.169118
C  6.227812 -1.566014 -0.921024
C  3.014277 2.44366 2.437028
C  4.790512 -1.367778 -2.888001
C  2.714254 3.455519 1.497169
C  6.066925 -1.599273 -2.326402
C  -8.435323 1.079731 0.43719
H  1.353277 -2.165677 -0.87105
H  1.729863 -1.507015 2.171672
H  2.678741 -2.787663 1.2213
H  2.102429 1.469609 -1.245924
H  5.248064 -1.269156 1.001641
H  3.207176 0.303508 2.786353
H  2.694725 -0.927417 -2.491668
H  -7.294555 -0.543009 1.315401
H  -2.00408 0.720484 -0.299478
H  -2.24401 0.174804 -2.008401
H  -2.800696 -1.61157 0.458979
H  -3.188557 -1.974824 -1.250065
H  -5.78903 1.869491 0.124666
H  -6.047122 1.542726 1.863703
H  -7.738909 -1.211369 -1.047317
H  -6.808413 0.198458 -1.63675
H  -3.751833 0.827803 1.110821
H  -4.710238 -0.550934 1.726123
H  -5.710853 -2.178216 0.010379
H  -5.389449 -1.834948 -1.722649
H  2.144869 3.876786 -0.564775
H  7.214118 -1.745351 -0.478128
H  3.269274 2.711747 3.468611
H  4.657435 -1.393129 -3.975517
H  2.736489 4.509743 1.795519
H  6.925839 -1.80495 -2.97502
H  -8.339946 1.850782 -0.351579
H  -8.627389 1.599672 1.394685
H  -9.323482 0.463688 0.201032
