program: Gaussian 09
title: 000210687
version: EM64L-G09RevD.01
frameworkgroup: C1[X(C12H13NOS2)]
method: RPBEPBE
basis: SDD
operation: Freq
keyword: #p
keyword: freq=noraman
keyword: PBEPBE/SDD
title: #p freq=noraman PBEPBE/SDD
converged: YES YES NO NO
title: Mulliken charges:
elementType: S S O N C C C C C C C C C C C C H H H H H H H H H H H H H
charge: 0.308797 0.110374 -0.216929 -0.018428 -0.593642 -0.319991 0.329270 -0.597075 -0.544796 0.507969 -0.679600 -0.373758 -0.385819 -0.234826 -0.228447 -0.232978 0.304975 0.229324 0.244570 0.254779 0.258089 0.226946 0.213608 0.230833 0.264531 0.256038 0.227876 0.228247 0.230062
chargesum: 0.00000
title: Mulliken charges with hydrogens summed into heavy atoms:
elementType: S S O N C C C C C C C C C C C C
charge: 0.308797 0.110374 -0.216929 -0.018428 -0.288666 0.153903 0.329270 -0.084206 -0.544796 0.507969 -0.008213 -0.109227 -0.129780 -0.006950 -0.000200 -0.002917
polarizability: 2.01087973e+02 1.53623443e+01 1.97907102e+02 -4.85762541e+00 1.08184642e-02 1.08151931e+02
1716.lowfreq: -12.3318 -2.5733 -0.0028 -0.0027 -0.0027 4.0668 19.7668 35.5782 51.4182
frequency: 19.7585 35.4863 51.4021 65.3081 90.3286 93.8721 162.5730 191.6154 204.3022 230.8664 266.3097 280.0865 322.5213 355.9840 381.3134 403.4093 405.2804 438.3519 493.4402 511.1012 527.3325 584.7976 615.9220 617.4724 669.9771 705.1603 714.8027 758.1529 804.7332 821.1549 843.6754 861.3932 892.4909 923.4811 940.9989 986.2616 990.2805 999.2850 1001.6635 1027.7399 1045.5573 1055.7429 1084.8019 1089.6832 1101.6318 1173.7849 1188.0203 1190.8666 1199.6087 1211.3078 1238.6984 1263.8152 1280.6029 1318.7520 1335.4662 1348.0493 1372.5001 1386.4768 1395.2914 1444.1528 1451.0383 1458.9484 1477.1060 1483.0673 1484.7093 1594.3558 1613.6119 1622.7090 2981.3572 2993.9169 3032.0748 3032.4778 3051.9055 3080.8276 3085.9099 3096.4282 3124.9772 3132.2336 3142.8861 3151.8702 3165.6626
redmass: 4.4737 4.7165 5.8946 7.1004 3.0581 4.0987 3.0770 5.4477 5.7868 1.3718 4.3337 5.5118 7.2588 3.1340 2.1484 7.4277 2.9402 4.6427 7.0467 8.0721 8.9735 4.6090 4.8632 6.1810 3.2502 2.1357 3.6004 2.0808 1.4394 3.2769 3.4947 1.2451 2.5806 2.2945 1.5225 1.3875 5.7158 3.1122 1.3445 2.2618 1.4646 5.6346 1.7876 1.8255 2.6853 1.0586 1.4596 1.1275 1.8639 2.8712 1.3486 5.3304 1.1651 1.6967 1.4093 1.5172 1.4201 5.5618 1.2091 2.0480 1.1476 1.0734 1.0478 1.0472 2.2245 6.0706 6.0171 11.5299 1.0363 1.0598 1.0587 1.0862 1.0988 1.1015 1.0991 1.1052 1.0848 1.0881 1.0927 1.0968 1.1017
irintensity: 0.5540 0.6860 0.1915 0.0622 0.5757 2.1786 2.6611 0.7779 1.1206 0.7177 4.3013 5.1656 7.4612 1.7186 1.9472 4.1861 0.1362 1.8300 15.9529 9.5377 9.0680 20.7055 20.2002 0.7754 1.3950 36.3706 48.6420 27.3993 16.1714 4.7079 1.7673 1.4199 21.1516 19.6851 14.2048 1.8101 0.6686 22.4752 0.5788 9.1955 0.6752 20.8523 48.5190 17.2865 2.8306 1.7218 38.4994 2.9620 202.4907 8.3315 7.9040 183.2731 7.0612 114.5102 5.2238 73.3140 29.0033 12.2742 17.0203 8.7463 34.5169 8.3470 12.7730 14.4440 18.5365 4.8336 1.6917 180.8631 25.4910 11.2853 14.4373 1.1453 1.1384 41.5876 36.8244 0.5294 0.1811 3.7596 12.9718 21.7962 23.9274
temp: 298.150 k
press: 1.00000 atm
elementType: 16 16 8 7 6 6 6 6 6 6 6 6 6 6 6 6 1 1 1 1 1 1 1 1 1 1 1 1 1
symmnumber: 1
zpe: 587802.9 jmol-1
zpe.correction: 0.223882 hartree
zpe.thermalcorrener: 0.239276 hartree
zpe.thermalcorrenthalpy: 0.240220 hartree
zpe.thermalcorrgfe: 0.178862 hartree
zpe.sumelectzpe: -1390.032648 hartree
zpe.sumelectthermal: -1390.017254 hartree
zpe.sumelectthermalent: -1390.016310 hartree
zpe.sumelectthermalfe: -1390.077668 hartree
dipole: -0.8479 -2.0387 -0.3455
dipole: 2.2349
quadrupole: -94.9911 -117.3668 -108.1889
quadrupole: 5.1610 -2.5693 3.6822
quadrupole: 11.8578 -10.5179 -1.3400 5.1610 -2.5693 3.6822
hfenergy: -1390.2565303 hartree
pointgroup: C01 [X(C12H13N1O1S2)]
dipole: -0.3559634 0.779829 0.1956794 debye
polarizability: 202.2512764|-15.3588682|196.4737231|1.6310931|6.3121259|108.4220071 unknown
InChI: InChI=1S/C12H13NOS2/c1-2-10-11(14)13(12(15)16-10)8-9-6-4-3-5-7-9/h3-7,10H,2,8H2,1H3
charge 0 multiplicity 1
29 atoms
S  -2.591003 -1.479223 0.817843
S  -0.373865 -3.176275 -0.480782
O  -1.06084 1.883627 -0.661435
N  -0.606152 -0.424782 -0.605652
C  -2.594994 0.410749 0.573137
C  -3.897926 0.928461 -0.07516
C  -1.361827 0.724964 -0.276815
C  0.644908 -0.268217 -1.413588
C  -1.066452 -1.673739 -0.166862
C  1.871041 0.035708 -0.559548
C  -5.131264 0.746942 0.830576
C  2.197119 1.376495 -0.228491
C  2.708498 -1.014452 -0.104585
C  3.339206 1.660619 0.552662
C  3.850298 -0.72899 0.677049
C  4.168286 0.608763 1.007733
H  -2.457843 0.866114 1.570719
H  -4.05195 0.41425 -1.042328
H  -3.740347 2.001643 -0.298267
H  0.444116 0.558899 -2.116089
H  0.769579 -1.211683 -1.970709
H  -5.319684 -0.320576 1.048022
H  -5.002373 1.275533 1.793445
H  -6.033718 1.153104 0.340933
H  1.550045 2.188441 -0.579542
H  2.457316 -2.050452 -0.358366
H  3.584297 2.699018 0.802056
H  4.491421 -1.546823 1.024381
H  5.055705 0.829681 1.611562
